##TITLE=$$ Begin of the data block
##JCAMP-DX=5.00 $$ ACD/SpecManager v 12.01
##SPECTROMETER/DATA SYSTEM=PERKIN-ELMER 0 IR
##DATE=20 Mar 2009 10:21:02
##DATA TYPE=INFRARED SPECTRUM
##DATA CLASS=XYDATA
##ORIGIN=Exported PE Spectrum Data File
##OWNER=Admin
##NPOINTS=3351
##FIRSTX=650.00000000
##LASTX=4000.00000000
##MAXX=4000.00000000
##MINX=650.00000000
##MAXY=98.30098724
##MINY=16.04384995
##XFACTOR=1.0000000000
##YFACTOR=0.000000100000000
##FIRSTY=84.64159393
##DELTAX=1.00000000
##XUNITS=1/CM
##YUNITS=TRANSMITTANCE
##XYDATA=(X++(Y..Y))
650H46415939k36969r95102j875381k152023j037064k18735J618653K359848R8724
659H43977890J71967m23508n73654j246643k586975m221879m400711j456985R22317
668H30161819r89532k784424l430252m651642n148315l940354j682434L13797J410675
677H09259338J544953P23419q61588k824859m955826p566452j1115952j5656280k0781097
686G47765656k5929566l1305084l9462204n3703766p0547981p4758492m8059273J1211396
694D15210686P7750625J15994263J09918022P3995209L5980377J2744751L588715Q83560
702H46066208r3460o95191j518783k587509l128052k894745k671356k931137l246918
711H26299057l348465l587570m069824m375153m459457m833451n606155o311493o924133
$$ plain form
650 846415939 846178970 845183868 843308487 841156464 840119400 839900665 841519318 843879166 843977890
659 843977890 844149857 843726349 843152695 841906052 839319077 835097198 830696487 829239502 830161819
668 830161819 829172287 826387863 822957611 818305969 813157654 809217300 807534866 807848663 809259338
677 809259338 810804291 811527710 810666122 807841263 802885437 795318985 784203033 768546753 747765656
686 747765656 721836090 690531006 651068802 597365036 526817055 452058563 403999290 415210686
694 415210686 492961311 608955574 718873596 792868805 828849182 841593933 845182648 846066208
702 846066208 845972748 845277557 843758774 841171265 838043213 835148468 832477112 829545975 826299057
711 826299057 822950592 819363022 815293198 810918045 806458588 801625137 796018982 789707489 782783356
720G82783356q117676j0109253j2286453j4402695j7130127k1199188k6683808l3096389
728F39757767l9111481m1590080l5946121j9176255O515503L3049584N0256233N2045402
736F45800552M0465393K3905869J0553513L224105J6938j620331k711411l550415m471512
745G11612701n376815n795288n833817o155548o890564p572632q219681r419174j1252975
754F45096207j3193932j5198097j7817192k0999527k3855210k5916671k7700005k9866218
762D70549355l2836991l7168579m2826843m7850075m9177952m5135517l5594044j9520855
770A60438499N065041L7047424O9464455R1598511R3071594O8862686K5853310j6095619
778E35305901l5669823k6902199l982010J2861557J5052757P996026J17340n434609
$$ plain form
720 782783356 774665680 764556427 752269974 737867279 720737152 699537964 672854156 639757767
728 639757767 600646286 559056206 523110085 503933830 510449333 543498917 593755150 645800552
736 645800552 686265945 710171814 720725327 723949432 723966370 722346039 719634628 716084213 711612701
745 711612701 706235886 700440598 694606781 688451233 681560669 673988037 665768356 656349182 645096207
754 645096207 631902275 616704178 598886986 577887459 554032249 528115578 500415573 470549355
762 470549355 437712364 400543785 357716942 309866867 260688915 215553398 179959354 160438499
770 160438499 165503540 202550964 272015419 363613930 456685524 525548210 551401520 535305901
778 535305901 499636078 472733879 468751869 481613426 496666183 504662209 504779549 499344940
786D99344940r326019j1550293j0512276m272156Q506165K7125320M7549248O3734970
794F10599899P0921021O8013687N7710266M4457321L1965180K2167816J5393677J0944061
802I32172928P888718N633392L895340K505798J442795P89642M75388K30179r1019
811I54943161l51257m44794n13153o71005q13752q84170j049881j413498j797867k036743
821I44967041k251816k589950k904435l017959l005524k904129k566910j990890j345902
830I22389526o50329J91650J065827J702804K043457K266846K449341K455749K215653
839I36130524J874542J586456J347046J107102Q72345O19430L01666J0758p1030L6011
849I43814850O9580j07193k99530k75116q8501L9368K2201o5231j63498k75879l78113
$$ plain form
786 499344940 490018921 478468628 467956352 463684196 472190361 499315681 546864929 610599899
794 610599899 681520920 749534607 807244873 851702194 883667374 905835190 921228867 932172928
802 932172928 940061646 945695038 949590378 952096176 953538971 954328613 954804001 955034180 954943161
811 954943161 954591904 954147110 953633957 952962952 952149200 951265030 950215149 948801651 947003784 944967041
821 944967041 942715225 940125275 937220840 934202881 931197357 928293228 925726318 923735428 922389526
830 922389526 921739197 921930847 922996674 924699478 926742935 929009781 931459122 933914871 936130524
839 936130524 938005066 939591522 940938568 942045670 942918015 943537445 943839111 943849869 943778839 943814850
849 943814850 943884430 943777237 943477707 943202591 943114090 943153458 943175659 943110428 942946930 942671051 942292938
860I42292938m06646l52173l02735l69644n70984p83081q40607p04956n01480l65371
870I37095261l15247l10211l35312l65830l55300l26386l53775m12674m07791l77121
880I33535614m53873o06537o65817o34384p04575r46884j273040j722260k467499l558578
890I20502167n086670p550049j1286621j5170288j6585846j3478546o240082K830734
898H47934799J1253815J6919250J8129654J4682312Q761139L598328Q50830j81122
906I21949005p58285j121521r84574n32913j95694m272J99661L01208J25504j95236
916I18782883m33121n81436o73676n73654k24380J49231L37295L91922L79181J81427
926I17735672k09503m96292m46091k23312j03608j03454j24359k09732m05045n83191
$$ plain form
860 942292938 941886292 941534119 941231384 940861740 940290756 939507675 938667068 937962112 937460632 937095261
870 937095261 936780014 936469803 936134491 935768661 935413361 935086975 934733200 934320526 933912735 933535614
880 933535614 933081741 932475204 931809387 931175003 930470428 929523544 928250504 926528244 924060745 920502167
890 920502167 915415497 907865448 896578827 881408539 864822693 851344147 845104065 847934799
898 847934799 859188614 876107864 894237518 908919830 917680969 921279297 922130127 921949005
906 921949005 921190720 920069199 919084625 918551712 918356018 918351746 918551407 918852615 918978119 918782883
916 918782883 918349762 917768326 917094650 916520996 916296616 916445847 916783142 917175064 917554245 917735672
926 917735672 917526169 917029877 916583786 916360474 916256866 916153412 916029053 915819321 915414276 914831085
936I14831085o39801o60553p00836o30646l83529j30463l2043m9820j27259k70309
946I11205826l28751n6686M37240O80542M75769J56250O104j30920m00544n81512n32532
957I10930786n27038p54242j004639j392365k852630n972443r302673r717636n288544
966H74118576J883621N958100J854324q974152j7627639j4766922n8289J6400299K3423462
975H82211380J8791733R361038K573318J15052l79944p06329r14765q86535q88520
984I09276428q83865o19507k98157l27835n98221p09304o98243q83255j191253j264267
994I01802521j098252j018295j125793j251984j365051j591187j927337k316285k901611
1003H87206726l865662n119476o371612p213440o860047m317703N20706O074753R958649
$$ plain form
936 914831085 914191284 913530731 912829895 912199249 911815720 911685257 911653214 911603394 911476135 911205826
946 911205826 910877075 910820389 911257629 911938171 912413940 912570190 912576294 912445374 912044830 911463318 910930786
957 910930786 910403748 909649506 908644867 907252502 904399872 898427429 889124756 879407120 874118576
966 874118576 876002197 881960297 883814621 874840469 857212830 842445908 842387619 858787918 882211380
975 882211380 901003113 910364151 912937469 913052521 912672577 911966248 911051483 910164948 909276428
984 909276428 908392563 907773056 907474899 907147064 906548843 905839539 905141296 904258041 903066788 901802521
994 901802521 900704269 899685974 898560181 897308197 895943146 894351959 892424622 890108337 887206726
1003 887206726 883341064 878221588 871849976 864636536 857776489 853458786 853979492 860054245 870012894
1012H70012894J0857925R279862O560516L766861J528778J16501o59485j239166j823883
1021H98400803k312546k684021l066406l409348l472900l227539k975617l028412l529510
1030H70694504m597550o318588q554459j0987777j3165665j4043884j1766129m903106
1038G96357346N478439J5380859K0459061J9345245J4083252P794266K617950n74264
1046H80942154j485825m1275L185349O577988Q167114P171707M658356K283554P55310
1055I12214432j50833p10450r22699q09326n87158m52270m31061n12848p09000r20944
1065I06007843r89914r36356r32846j004409j002579r19571r67331j275635j729736
1074H96249466k156448k487107k796020l359070m471665n893402o811370o864548o764069
$$ plain form
1012 870012894 880870819 890150681 896711197 900478058 902006836 902123337 901463852 900224686 898400803
1021 898400803 896088257 893404236 890337830 886928482 883455582 880228043 877252426 874224014 870694504
1030 870694504 866096954 859778366 851223907 840236130 827070465 813026581 801260452 796357346
1038 796357346 801835785 817216644 837675705 857020950 871104202 878898468 881516418 880942154
1046 880942154 879456329 879415054 882600403 889178391 897345505 904517212 909175568 911459122 912214432
1055 912214432 912063599 911353149 910430450 909621124 909033966 908581696 908150635 907637787 906928787 906007843
1065 906007843 905017929 904081573 903148727 902144318 901141739 900222168 899254837 897979202 896249466
1074 896249466 894093018 891605911 888809891 885450821 880979156 875085754 868274384 861409836 854645767
1083H54645767o952896n834122q30764P925796J5937195J8004227J3503570O581574
1091I02980347J524200n38559q16574o04553m61884n28412p33871q95767r34220r03015
1101H98087692q18176o80237o24618p70188r67407r86023q71506q28628q62732q52280
1111H89825897q54187r90600j149598j131591r85337r00116q78296q13369p56150p98416
1121H80568237q44879p98645p98492r66568j125946j094361j032867j156693j333923
1130H71415863j337509j267395j339417j493454j601486j806412k237320k666244k880402
1139H54786224l117828l698425m560776n655518p396850j0026551j2760314j4319916
1147G93250046j4458542j4686508j7438736k4325257l4330291m3502961m7867240m7366753
$$ plain form
1083 854645767 847692871 841858749 841027985 848953781 864890976 882895203 896398773 902980347
1091 902980347 904504547 903965988 903149414 902544861 902082977 901554565 900820694 899924927 898990707 898087692
1101 898087692 897269516 896589279 895964661 895194473 894227066 893241043 892369537 891540909 890678177 889825897
1111 889825897 888971710 887981110 886831512 885699921 884714584 883814468 882936172 882122803 881366653 880568237
1121 880568237 879723358 878924713 878126221 877159653 876033707 874939346 873906479 872749786 871415863
1130 871415863 870078354 868810959 867471542 865978088 864376602 862570190 860332870 857666626 854786224
1139 854786224 851668396 847969971 843409195 837753677 830356827 820330276 807569962 793250046
1147 793250046 778791504 764104996 746666260 722341003 688010712 644507751 596640511 549273758
1155E49273758m5025520m0060959k3924294J1448937N9784660R9719276J11990166
1162G23206024R5119248O3372421L3264465J3191910K896729j449509l260956m286880
1170I22053452m904404n095062n144501n352173n571594n623627n792160o336594o954422
1179H71278915p337799p807998q776551j0094833j1606674j3791046j7139969k1399155
1187G73324890k6008758l0735474l5529938m0688324m7001266n2843819m9828415k5909118
1195D64779778K1159744P4334793J07516823J06924743Q0746918M8940048K5768433
1202I30171280J3102951O764526L415833J400909l66516k064209l047485l231354l381500
1211I42764435l861466m241104m307480m404068m665222m886780n169525n702743n826493
$$ plain form
1155 549273758 504248238 464187279 440262985 451711922 511496582 611215858 723206024
1162 723206024 818325272 881697693 914962158 928154068 931050797 929601288 926340332 922053452
1170 922053452 917149048 912053986 906909485 901557312 895985718 890362091 884569931 878233337 871278915
1179 871278915 863941116 856133118 847356567 837261734 825655060 811864014 794724045 773324890
1187 773324890 747316132 716580658 681050720 640362396 593361130 540517311 490688896 464779778
1195 464779778 485939522 560274315 667791138 774715881 855462799 904402847 930171280
1202 930171280 943274231 950038757 953454590 954855499 954488983 952424774 949377289 946145935 942764435
1211 942764435 938902969 934661865 930354385 925950317 921285095 916398315 911228790 905526047 899699554
1220H99699554m296951p90176L480453O750870P940445P044449M859772K528686R02329
1229I28119431L3187n08346r09424j073837j099243j209717j292343j052628n86243
1238I20420837k90756k76871l49578m98352r09501j529464k103119k633820l342438
1247I08486938m205474m985047n633545o237640o689911o953583p580719r428940j2708511
1256H44063568j6366806j8082046j4718018m082031J1989288K6991043L4072037L1147537
1264H95014572K1731186J1481400M162139L87269r97925j291123j309127j379853j510696
1273I26287842j696243k080536k756348l517761l915406l507690k143707k42768J261292
1282I07688675J544037N97839p58285j573258j366043k45895J166610K021027J820831
$$ plain form
1220 899699554 895402603 894612427 898092880 904843750 912784195 919828644 924688416 927217102 928119431
1229 928119431 928152618 927644272 926734848 925661011 924561768 923352051 922059708 921007080 920420837
1238 920420837 920130081 919853210 919503632 919005280 918095779 916566315 914463196 911829376 908486938
1247 908486938 904281464 899296417 893662872 887425232 880735321 873781738 866201019 856772079 844063568
1256 844063568 827696762 809614716 794896698 790814667 802803955 829794998 863867035 895014572
1264 895014572 916745758 928227158 932389297 932776566 931778641 930487518 929178391 927798538 926287842
1273 926287842 924591599 922511063 919754715 916236954 912321548 908813858 906670151 906427383 907688675
1282 907688675 909232712 909830551 909072266 907499008 906132965 905887070 907053680 909074707 910895538
1291I10895538Q13065l17459j132736j656723j961518j891937j334457m98963K40936
1300I03155746O21949N70144K27890l1280J62659Q01086J507645J914825J919708J592636
1310I12443008J076966N92499L04107J30387j12076l59497l97415k58179k24991l90472
1320I12804337n30167n15976m78516m94766m67071l78342l68042m74701n39475n01480
1330I08055801m86831n50156o02951o38580p55234r04465q99505p32117o34842o98853
1340I01152267p47833p57522q84781j084824j171112j168289j267929j452179j474610
1349H91143188j300125j148605j106720r92126p91779o96182p46613q20465r26437
1358H82614136j175766j456299j558151j632691k039261k588348k798462k756958k752304
$$ plain form
1291 910895538 911708603 911391144 910258408 908601685 906640167 904748230 903413773 902914810 903155746
1300 903155746 903777695 904347839 904575729 904544449 904707108 905508194 907015839 908930664 910850372 912443008
1310 912443008 913519974 914112473 914416580 914546967 914434891 914075394 913677979 913419800 913194809 912804337
1320 912804337 912274170 911758194 911279678 910784912 910317841 909939499 909571457 909096756 908557281 908055801
1330 908055801 907568970 907018814 906415863 905777283 905022049 904117584 903218079 902485962 901851120 901152267
1340 901152267 900404434 899646912 898762131 897677307 896506195 895337906 894069977 892617798 891143188
1349 891143188 889843063 888694458 887587738 886595612 885803833 885107651 884361038 883540573 882614136
1358 882614136 881438370 879982071 878423920 876791229 874751968 872163620 869365158 866608200 863855896
1367H63855896k667160k237549j644516j294098j138229q51135o14090r52912j727447
1376H50728760k292938k648240l179779l801345m185334m448166m965744n738296o848755
1385H12620163r065170j2904435j6086959j4976960r831085l584671J710968M687195
1393G52569046M110413l59040o510391j1609802j6501541k2646408k7007370k6377411
1401F45667496k3258629k0840874j9153442j8973160k3014297l1171227m0104294m7177429
1409D21974144m9342804m0105400j4399452K2303581N7732811Q3175812R3648987Q6859169
1417F61846848O5552902L5730285Q923645m197006p512283r243240j2622529j8181152
1425G20297470k4991455l3282852m5322914o1738892p5501900p2136764m4976540o898803
$$ plain form
1367 863855896 861188736 858951187 857306671 856012573 854874344 854023209 853409119 852456207 850728760
1376 850728760 848435822 845787582 842607803 838806458 834621124 830172958 825207214 819468918 812620163
1385 812620163 803554993 790650558 774563599 759586639 749755554 746170883 747881851 752569046
1393 752569046 756679459 756320419 749810028 738200226 721698685 699052277 672044907 645667496
1401 645667496 622408867 601567993 582414551 563441391 540427094 509255867 469151573 421974144
1409 421974144 372631340 332525940 318126488 340430069 398162880 481338692 574987679 661846848
1417 661846848 727399750 763130035 772053680 767856674 760344391 751101151 738478622 720297470
1425 720297470 695306015 662023163 616700249 554961357 479459457 407322693 362346153 355447350
1433C55447350K6985092N7643280R5200767J22369614J05058899O5473785M1878815
1440H70057602L2783585K5998992J7416001R575043M690780K099457J292267K217026
1448I66130753L724517L992844L353119K857056K115478Q36105j48696j75400k57797
1457I82427979j146393j427079q08563o29043r32770j218033j430206j882172k339096
1466I70614624k217560j777954j536560j530609j457062j159286q79822j218872k047959
1475I56788940l087616m231872n086746n576248o105271o557159n817719l483887p22198
1484I16120224J370621K758484L559188M016190M572601N075302M529953K612610N05829
1493I45121002q65478j101303J79672K467804L801040L536835K608109J448211M24958
$$ plain form
1433 355447350 382432442 440075722 535276489 657646103 762705002 828178787 870057602
1440 870057602 902841187 928840179 946256180 955831223 960522003 962621460 963913727 966130753
1448 966130753 969855270 973848114 977201233 980058289 982173767 983009872 982861176 982685776 982427979
1457 982427979 981281586 979854507 979045944 978416901 977484131 976266098 974835892 972953720 970614624
1466 970614624 968397064 966619110 965082550 963551941 962094879 960935593 960055771 958836899 956788940
1475 956788940 953701324 949469452 944382706 938806458 932701187 926144028 920326309 916842422 916120224
1484 916120224 917490845 920249329 923808517 927824707 932397308 937472610 942002563 944615173 945121002
1493 945121002 944255524 943154221 943333893 945801697 949602737 953139572 955747681 957195892 957620850
1502I57620850j25504k82745k59476n47714m85916M73480K06680m59442o66885o95114
1512I54778214n96695m62342j93786r1629l82462p29446n70374j13449j59149o33545
1522I50845337r30481r37424j006469j097794q76236o05011o61545q06122o83670n08194
1532I42732391r03167j530609j414567q86688o13556p23800j374894k993011n253067
1541I27039032o339722n356598l780288k529526j729050j578064k258682l753967n347367
1550H94365768o092147o761017q751679j2176208j4363632j3338547j3003464k7533951
1558G92345123q0418472j05508194n7271614k0649719N372390M3578568Q2475929R6554184
1566G56478195P8789063N2615127L4047470K2363358J2186890N173492K815857K330933
$$ plain form
1502 957620850 957495346 957212601 956953125 956405411 955919495 956392975 956599655 956140213 955473328 954778214
1512 954778214 954181519 953719177 953525391 953433762 953051300 952321854 951751480 951638031 951478882 950845337
1522 950845337 949914856 948977432 947970963 946873169 945996933 945391922 944730377 943924255 943240585 942732391
1532 942732391 941829224 940298615 938884048 937997360 937383804 936660004 935285110 932292099 927039032
1541 927039032 920699310 915342712 911562424 909032898 907303848 905725784 903467102 899713135 894365768
1550 894365768 888273621 881512604 872760925 860584717 846221085 832882538 819879074 792345123
1558 792345123 711926651 606418457 549146843 528497124 533869514 577448082 659924011 756478195
1566 756478195 835267258 887882385 921929855 944293213 956480103 961653595 964469452 966800385
1574I66800385J521682L59040R613q4458m93164p28760p07321o18057o38657o15463
1584I64804840m41818l42789n47714p61337p42417p49664r22928r73892p53632n75638
1594I57993011o14776n92575l55530k12784l30887m41513l24783j48392j32904j50833
1604I54688034m3259O0273J1596p3547O4850K18963J12381l5553J12305L85513L06321
1615I55807877j91269l86811j72577j78985k16217j44501j18942j50833j25962k3803
1625I54097977l891j85700m44488m74549l92608m26941m38461k36969r614k50549m20914
1636I50813293r5977M1504j68381m75159p00989p50122o84509n15900j06277K30789
1646I47588272L04642J49154j73263k27509l13720r92127k001877q01315l1509k10343
$$ plain form
1574 966800385 968322067 968681107 968690720 968606262 968113098 967384338 966677017 966058960 965420303 964804840
1584 964804840 964363022 964020233 963472519 962711182 961968765 961219101 960296173 959322281 958568649 957993011
1594 957993011 957378235 956785660 956430130 956217346 955886459 955444946 955120163 954971771 954838867 954688034
1604 954688034 954644775 954705048 954716644 954643097 954707947 954926910 955039291 955003738 955116043 955501556 955807877
1615 955807877 955616608 955229797 955057220 954878235 954662018 954517517 954398575 954247742 954121780 954097977
1625 954097977 954094086 953908386 953463898 952989349 952596741 952169800 951731339 951494370 951484756 951234207 950813293
1636 950813293 950717316 950758820 950590439 950115280 949414291 948664169 947979660 947463760 947357483 947588272
1646 947588272 947892914 948042068 947868805 947641296 947327576 946335449 944333572 943532257 943500748 943290405
1656I43290405m67071q57620j127778j239242j246872j157150r06906p95441j019516
1665I34472809j500092k246246l512344n292817o046905m300385j666488L5324Q60214
1674I10803070J489716J631317O86416n75332j250763r72901K49787J992798M087677
1683I18141785P377319R496460N778961K112122J224823J031189O33468M7684k76031
1692I45567780k25983j60980l34168k93655P6904r231m23890m29153N15594R35669
1702I45218887P70264N87692L48969K52990J53962k2660j81503k49863k41699j92947
1712I46444092o9428J09864K68173K97928P3623j76620k14081m0283R6588K6169r0637
1723I46725388r9259j00784k22321k66037k14309j37482j5946Q0643P2403j46103l34091
$$ plain form
1656 943290405 942823334 941965714 940837936 939598694 938351822 937194672 936287766 935492325 934472809
1665 934472809 932972717 930726471 927214127 921921310 915874405 911574020 909907532 909942856 910803070
1674 910803070 912292786 913924103 914610519 914035187 912784424 911811523 912061310 914054108 918141785
1683 918141785 925519104 935015564 940794525 942906647 944131470 945162659 945796127 945843811 945567780
1692 945567780 945341797 945180817 944846649 944552994 944629898 944620667 944196777 943767624 944283218 945218887
1702 945218887 945989151 946576843 946925812 947178802 947332764 947310104 947128601 946878738 946637039 946444092
1712 946444092 946374664 946484528 946752701 947050629 947124252 946947632 946733551 946693268 946789856 946816025 946725388
1723 946725388 946626129 946525345 946303024 946036987 945822678 945685196 945669250 945749893 945822296 945676193 945342102
1734I45342102k27661l21884l35541l34473l31573o790L66058L14407N6534j34125
1744I44387054k29263k91290l24173m39606o01730n90286k55280K50015M54483M07486
1754I42767410L25775K47193J70975P1029n4931j42670j28174m9210L0594j31759m47769
1765I42658463p53785q55255n86014o8283K93045K10495j18942k50854k49329k67868
1775I40011673l61633m65317m21906l00064k21939k02484k96478m02985m76990m19845
1785I36442032m69971r45434j707535k434616l213425m579620o361084o525040l870773
1794I06334534m20151J740036K429199K449799K921600M474106O295929O590042N044937
1803I37860031L037491J590195P71942M75387N43137N60989K00272k77252l83301k61002
$$ plain form
1734 945342102 945114441 944792557 944457016 944122543 943790970 943784180 944150238 944464645 944521179 944387054
1744 944387054 944157791 943866501 943542328 943102722 942500992 941910706 941655426 941905441 942359924 942767410
1754 942767410 943093185 943340378 943511353 943582382 943527451 943384781 943256607 943207397 943237991 943106232 942658463
1765 942658463 941904678 941049423 940463409 940395126 940688171 940898666 940779724 940528870 940279541 940011673
1775 940011673 939650040 939184723 938762817 938462753 938240814 938038330 937741852 937338867 936861877 936442032
1785 936442032 935972061 935026627 933319092 930884476 927671051 923091431 916730347 910205307 906334534
1794 906334534 905914383 907654419 910083618 912533417 915455017 919929123 926225052 932815094 937860031
1803 937860031 940897522 942487717 943259659 943735046 944278183 944839172 945039444 944762192 944378891 944117889
1813I44117889l34625n18722n33905l18528j27716j10855r8343j3809Q3008J26572
1823I42270966R2086N341j10169j71279j70517k48337k92511j69144l2654N494j6480
1834I41162796l2272J9226N1040p2784k64130k86560j61972q7662k15530l41263j65786
1845I39605103R6588J74637N3634j55716l51867n18418o71005q50754j074219j437912
1855I34870071j868057k301330k904587l936768n169372n521164l872910n94482K418442
1864I11119843L551559K652512N45806j882019l624649l304596o56356K775879N381240
1873I16559219O340714N683975M299164L091049K233200J541748R59549M86984O9123
1882I41264725k79007m27017l97339l98178m38691l21884J2284L36227L61404J60218
$$ plain form
1813 944117889 943783264 943264542 942730637 942412109 942284393 942173538 942075195 942061386 942144394 942270966
1823 942270966 942363052 942368393 942258224 942086945 941916428 941668091 941375580 941206436 941173782 941179276 941162796
1834 941162796 941130524 941149750 941200790 941128006 940863876 940577316 940415344 940327682 940112152 939770889 939605103
1845 939605103 939701691 939876328 939929962 939774246 939422379 938903961 938232956 937382202 936307983 934870071
1855 934870071 933002014 930700684 927796097 923859329 918689957 913168793 909295883 908701401 911119843
1864 911119843 914671402 917323914 917869720 915987701 912363052 909058456 908402100 911177979 916559219
1873 916559219 922899933 928583908 932883072 935974121 938207321 939749069 940708618 941195602 941264725
1882 941264725 940985718 940558701 940161362 939763184 939324493 939002609 939014893 939351120 939712524 939872742
1892I39872742m4632k03781k76947k20795j45264j63498j78604q0643m3792k54441
1902I38260345n74798o26221l16315L5706J60065R4681q0719k43607k75345j50452
1912I36283340o9961k68631o70319j000976j066590p72628k31934J93481K08283j66550
1922I32437515o61545j056137j448974k008591k785873l891831n414200o508178n474625
1931I03187561j504974L704300O927795O370010L131943l52402k501678l077469k701263
1940I13183823k341309k563324k602920q37708K842941O406098P777557O598435M256820
1949I32720413K300949J154404N17654J88370J24741K31628L81165N38788O32095N43594
1959I39333801L26233J75705J20239n722k06604k64282j06811N2719K8839o4469p5759
$$ plain form
1892 939872742 939828110 939624329 939347382 939126587 938981323 938817825 938639221 938558578 938514786 938260345
1902 938260345 937685547 937059326 936743011 936778717 936938782 937033463 936952744 936709137 936433792 936283340
1912 936283340 936213379 935944748 935274429 934273453 933206863 932434235 932202301 932395782 932604065 932437515
1922 932437515 931775970 930719833 929270859 927262268 924476395 920584564 915170364 908662186 903187561
1931 903187561 901682587 905386887 912314682 918684692 921816635 921464233 918962555 915885086 913183823
1940 913183823 910842514 908279190 905676270 904838562 907681503 914087601 921865158 928463593 932720413
1949 932720413 935021362 936175766 936693420 936881790 937006531 937238159 937619324 938158112 938790207 939333801
1959 939333801 939660034 939835739 939955978 939950256 939743652 939479370 939372559 939425278 939454117 939389648 939313889
1970I39313889j18027l66059p49359r98077q98819m22363K79998Q79288J007004N73883
1980I38501358j35879p14493r25370p13729j86768M12750P70798O89468K78397j11084
1990I37865448k28500j40610n5542j2970J04141K58179K50549N5237n6229J30005M12445
2001I38582153M13590N4550l69110o16074o44150m63104j52359N2796k8229j75553
2011I36654510K289M88816Q14056O63986K62146K4185P2251K20871K89077K34833R0256
2022I39817276p4463k11487l57284n07431m60816k5024O06842Q66012M00544m99420
2032I39554749j184693j238632p46307j21613K37579J87531j18332l91312m29382j94092
2042I35555496K10953N59616N79376J70670l92075o32095l50113J51520L94974K17208
$$ plain form
1970 939313889 939195862 938829803 938080444 937082367 936183548 935761185 936041183 936920471 937927475 938501358
1980 938501358 938365479 937650986 936725616 936011887 935825119 936237869 937008667 937698135 937976532 937865448
1990 937865448 937636948 937496338 937440796 937427826 937531967 937790146 938040695 938095932 938039703 938169708 938582153
2001 938582153 938995743 939050293 938681183 938065109 937420959 936957855 936805496 936858292 936830063 936654510
2011 936654510 936656799 937145615 937959671 938623657 938885803 938909988 938982239 939203110 939492187 939727020 939817276
2022 939817276 939742813 939531326 939174042 938666611 938205795 938180771 938787613 939653625 940054169 939554749
2032 939554749 938370056 937131424 936385117 936263504 936501083 936688614 936570282 936178970 935749588 935555496
2042 935555496 935766449 936326065 936905441 937076111 936684036 936051941 935701828 935853348 936248322 936465530
2052I36465530j30920l02963j88446L1433J47705J81732L08685N39093O39191M39758
2062I38130798Q2856j81122l05176l79257l77655k05384N9052J91116Q3313j47171
2072I36951370l13720k92206l3112L74375O74057O23779K74811o4621j80207j03302
2082I37911224N3788K24762L19595K22855m2573k74734l03802j51597M8142J85699
2092I38193359J97602O7825j16653k05307j52359o9809o5918j23749j73874Tq9722
2103I37287521R6054K98386L53851K09885J2589o6758l0822j6633j07803k43149k88925
2114I37504196j73569K4643J37711Q5983l2730p7972m2420j0147m58J8921L82j28021
2126I37306519k73591k36816N264K45667L25699K89383J96228l586k83661m42810l80325
$$ plain form
2052 936465530 936334610 936031647 935843201 935874634 936022339 936204071 936512756 937051849 937691040 938130798
2062 938130798 938213654 938032532 937727356 937348099 936970444 936765060 936824112 937015228 937098541 936951370
2072 936951370 936637650 936345444 936312332 936686707 937360764 937984543 938259354 938194733 938014526 937911224
2082 937911224 937965012 938189774 938509369 938732224 938689651 938414917 938111115 937959518 938007660 938193359
2092 938193359 938390961 938458786 938342133 938136826 937984467 937914658 937848740 937724991 937551117 937377243 937287521
2103 937287521 937383575 937681961 938035812 938245697 938258286 938191528 938160706 938144073 938036270 937793121 937504196
2114 937504196 937330627 937355270 937492981 937578964 937546234 937468262 937425842 937415695 937415237 937434158 937434540 937306519
2126 937306519 937032928 936796112 936801376 937047043 937372742 937662125 937858353 937854767 937571106 937128296 936747971
2137I36747971k77100k97852l09753j47781J8692j06125m46930n94635l44696Q2474
2147I34324265M11071O21186P73925P80564N37719J67237l8529R8725M40139N80445
2157I38696747J43814p83844j536484j463394o39496K37656N74188L06091k63519p68585
2167I34503174r22852o06155K6626O03867Q57849Q40607P35855N62591K23237k04010
2177I36620789m32663l04108j5488J09635r537j73416j81351l0060J51902K45437J92642
2188I36173782P553k25753m25263n95627p52945p65914m24271K42386Q29773Q80661
2198I34944382L51867l34549p18307o79627l97644o9198K44522N36804P37915P42722
2208I35358887N39016K60697P8354L1357J1901o9961j58157j27869O0730L20358N02472
$$ plain form
2137 936747971 936470871 936173019 935863266 935715485 935734177 935628052 935181122 934586487 934241791 934324265
2147 934324265 934735336 935356522 936130447 936911011 937448730 937615967 937577438 937676163 938116302 938696747
2157 938696747 938840561 938056717 936520233 935056839 934417343 934654999 935229187 935535278 935271759 934503174
2167 934503174 933580322 932974167 933000793 933604660 934462509 935303116 936038971 936601562 936824799 936620789
2177 936620789 936188126 935884018 935868530 935978165 935968628 935795212 935613861 935583801 935735703 935981140 936173782
2188 936173782 936181335 935955582 935530319 934934692 934181747 933415833 932991562 933233948 934063721 934944382
2198 934944382 935296249 934961700 934243393 933563766 933166122 933096924 933341446 933878250 934616165 935358887
2208 935358887 935897903 936158600 936236954 936268311 936280212 936210251 936052094 935924225 935984955 936305313 936807785
2219I36807785M70429J76467k51999n50994n61371m02832l02048k78015j32599K17819
2229I35192642N55725O03638L58047N3940j32675k11716k50625k76795l30581m63562
2239I35098038n99823n21164j27793L56827N94864N22614L61480K53830Q5602k11868
2249I35812607l84903j08719N09567R21707O91529m6311p19223q68530m83246N3940
2259I35378418L37830K67028J15204K02790M99343O51932L90320j35498n54123o47202
2269I36506042m59365j55640R6207J58157n264k79923n30472p30667q65173q00018
2279I32933884l95127J86768N66406N41916L43399L20892N21164O93512O59638N29709
2289I36902161M51049L81775J45951k16828m72870m04358j13449J52207K09198O6299
$$ plain form
2219 936807785 937278214 937454681 937202682 936651688 936090317 935687485 935385437 935107422 934974823 935192642
2229 935192642 935748367 936352005 936710052 936763992 936631317 936419601 936168976 935892181 935561600 935098038
2239 935098038 934498215 933977051 933849258 934206085 934800949 935323563 935685043 935938873 936024475 935812607
2249 935812607 935427704 935318985 935828552 936750259 937441788 937395477 936676254 935807724 935324478 935378418
2259 935378418 935716248 935983276 936098480 936301270 936800613 937452545 937842865 937707367 937153244 936506042
2269 936506042 936046677 935891037 935987244 936145401 936140137 935860214 935329742 934599075 933733902 932933884
2279 932933884 932538757 932725525 933291931 933833847 934177246 934498138 935019302 935712814 936372452 936902161
2289 936902161 937353210 937734985 937880936 937664108 937191238 936786880 936673431 936825638 937034836 937101135
2299I37101135j72424m39911n93643n95627m46396l82461m51813o11878o09130l96271
2309I32401581l8758K52991M41895M66842M35715L07312K93350L04718M51966M58679
2319I35776291N01175M31595N43518O17065P46079P80639P57065P64008N75256L92380
2329I41885071Q1634j68762k70691l68576k59094k10419j42898K05688K49558J201553
2339I42203064L138199m21677L78342m25034J121216M672318j483002k197495k580719
2348I44405212j119918k9831L42407m21753j244965r69391J18256J122589J188736
2357I43391342M27246k13852j26037M69665M94080j93863p75375o70472p9193J91956
2367I42915497j05515m10843l07540L9291K84576L66593M16412M65241L79562P9956
$$ plain form
2299 937101135 936928711 936488800 935895157 935299530 934853134 934470673 934018860 933406982 932797852 932401581
2309 932401581 932362823 932615814 933057709 933524551 933960266 934267578 934560928 934865646 935317612 935776291
2319 935776291 936277466 936709061 937252579 937869644 938615723 939396362 940153427 940917435 941492691 941885071
2329 941885071 941966705 941797943 941527252 941158676 940899582 940689163 940546265 940751953 941001511 942203064
2339 942203064 945341263 944919586 945297928 944872894 945994110 950666428 949183426 946985931 944405212
2348 944405212 943285294 943255463 943597870 943176117 941931152 940961761 941080017 942202606 943391342
2357 943391342 943818588 943604736 943478699 943948364 944442444 944248581 943473206 942802734 942723541 942915497
2367 942915497 942809982 942399139 942091599 942130890 942415466 942782059 943198471 943663712 944043274 944123230
2377I44123230l14636n94025o91452o81610o61087o43005n79911m49676l07770k54364
2387I38945694l22266l94287k92511Q774L16010M23050L42941K55203K60315K92892
2397I39835815K67106J80892N3559j15051k61918k52151n1270J66321J89667J9379
2407I40032349j51139j84021j30005j09405j52741k00576k01035j52130o6605N7297
2417I38741989K13471L58810M31976L99857K72674Q3237j15051k30103j80587p401
2427I39968872J21384Q5525n2032j58081k28501l50723m89960m68216k08587J24435
2437I38344116L01361K59171R1247j06353k78244l65143l28751k13547j14593q7738
2447I37501526j30463k21405l33786m26178m62189m19540k63824L1051L97797O63681
$$ plain form
2377 944123230 943808594 943214569 942523117 941841507 941180420 940537415 939957504 939507828 939200058 938945694
2387 938945694 938623428 938229141 937936630 937945404 938261414 938684464 939027405 939282608 939542923 939835815
2397 939835815 940102921 940283813 940337372 940222321 939960403 939708252 939656982 939823303 940012970 940032349
2407 940032349 939881210 939697189 939567184 939457779 939305038 939104462 938903427 938751297 938684692 938741989
2417 938741989 938955460 939314270 939746246 940146103 940418777 940502014 940386963 940156860 939976273 939968872
2427 939968872 940090256 940175781 940123749 939965668 939737167 939386444 938896484 938428268 938219681 938344116
2437 938344116 938645477 938904648 938995895 938889542 938611298 938246155 937917404 937703857 937589264 937501526
2447 937501526 937371063 937149658 936815872 936389694 935927505 935507965 935244141 935275192 935672989 936336670
2457I36336670O93512N29861L42408K60772K96555L86429M41970L79105J77689p6523
2467I39768448k58408l19977l07159k75116k35519j88599j55258j46332j21384j9073
2477I37741623J53809K86254K64512J17950P858K5711O2638l1052k03552k41776n6305
2488I38127670J96991L14179K46200O4316j48773l00140k95487j50070j4267P400j1673
2499I38036346L9063J22147J24053M4938j6861k7924l9291o9886j01013j67846l26615
2510I37617111n31158o63529o97326p12052p28302o57730m59823k35215r3155j3275
2520I32825546Q4915K02332K81448L28751M26102O13098Q18329R32388R15604Q07418
2530I38235931O48423M36401J92261K3346L3798J60904K00958N4016j38016j79519
$$ plain form
2457 936336670 937030182 937560043 937902451 938163223 938459778 938846207 939288177 939667282 939844971 939768448
2467 939768448 939510040 939190063 938882904 938607788 938372269 938183670 938028412 937882080 937760696 937741623
2477 937741623 937895432 938181686 938446198 938564148 938572006 938597717 938660355 938629303 938425751 938183975 938127670
2488 938127670 938324661 938638840 938885040 938949356 938800583 938500443 938204956 938054886 938040619 938048019 938036346
2499 938036346 938075409 938197556 938321609 938366547 938349686 938321762 938282471 938212585 938111572 937943726 937617111
2510 937617111 937085953 936422424 935725098 935013046 934284744 933627014 933167191 932931976 932838821 932825546
2520 932825546 932910461 933112793 933394241 933722992 934149094 934762192 935580521 936512909 937428513 938235931
2530 938235931 938884354 939320755 939513016 939536362 939570160 939731064 939932022 939986038 939848022 939668503
2540I39668503p7820o714o6604j99585l14332l67507l19367j38779J11771K88849L09372
2551I38887787K09808N2872j31683k85874l12958j91574k6169P1869Q8883M7989p2327
2562I38338623k79465m85305n77622n47104m74167m04663l03573j30234R7427L13721
2572I35547638M43802M41131L32261K21481K02331K53144K55127J22375j00479k80228
2582I37438583l16085k16752p1792L7536R8343J45798J98898K32621K08511J21918
2592I37877579J6174m0665j2664M8904K8000j36261l48969m31671l12271j10092r918
2603I36568146q1558k41929l53012l17459j13144J96915M80957O13785N75180M59976
2613I37787857L75290L35236K74658J54266K4643l4790k2583k5177j13296k60392l90548
$$ plain form
2540 939668503 939590683 939583969 939517365 939317780 939003448 938635941 938316574 938177795 938289566 938578415 938887787
2551 938887787 939097595 939150467 939018784 938732910 938419952 938228378 938202209 938274078 938362961 938410950 938338623
2562 938338623 938059158 937573853 936996231 936449127 935974960 935570297 935266724 935136490 935233917 935547638
2572 935547638 935991440 936432571 936764832 936986313 937188644 937441788 937696915 937819290 937718811 937438583
2582 937438583 937122498 936905746 936833954 936871490 936969833 937115631 937314529 937547150 937755661 937877579
2592 937877579 937893753 937853088 937840424 937889328 937917328 937781067 937432098 937000427 936688156 936578064 936568146
2603 936568146 936486588 936244659 935891647 935574188 935461044 935657959 936138916 936752701 937327881 937787857
2613 937787857 938163147 938498383 938773041 938927307 938951950 938917160 938894577 938869400 938756104 938495712 938105164
2624I38105164m74320n22766m94843k87780J31759O13709R02634Q52737N50003K20184
2634I39596481L6087J0147M3946L9367m2800j96305l87039n42603n59616l68347m196
2645I37625122L97415O83594P60879O19584L32260L8681j11771n9891J15967K71912
2655I40673752L23562K84729K00654Q5754m7989j34277q5297J02463L08227L86582
2665I42098160L01666J43127K0447l0517l7995l2654k3498j0529P248L0823M8370K9908
2677I42544556l7003j11313j28174p3471o027R689k5405n6305m4175n493J6938O027
2689I42089844j0758J0987Q3465J59531J64490P2174n5085j23138j07574p1183p0572
2700I42142181p9422m2038K0676J5488j01319k56118l41492l33099k91443k79007l10746
$$ plain form
2624 938105164 937630844 937108078 936613235 936325455 936457214 937070923 937973557 938826294 939376297 939596481
2634 939596481 939632568 939642715 939686661 939726028 939683228 939486923 939099884 938557281 937997665 937629318 937625122
2645 937625122 938022537 938706131 939467010 940086594 940418854 940457535 940345764 940285873 940401840 940673752
2655 940673752 940997314 941282043 941482697 941568451 941520462 941386185 941300888 941403351 941711578 942098160
2665 942098160 942399826 942542953 942563400 942532883 942494888 942462234 942438736 942428207 942435455 942466278 942514648 942544556
2677 942544556 942507553 942396240 942268066 942194595 942188568 942198257 942172852 942116547 942072372 942066879 942083817 942089844
2689 942089844 942079086 942090073 942173538 942333069 942497559 942569733 942514648 942391510 942283936 942212753 942142181
2700 942142181 942062759 942020721 942041397 942056885 941955566 941699448 941357956 941024857 940733414 940454407 940143661
2711I40143661l65142l93448l31116j52283P9117K49100K98691K68554K39258K53830
2721I40290222L01056L41492L41720L05329K72979K67029K43836J41906k0828j41754
2731I42342987j41067l4562J05133K12098K40020J70136M0512p0877j23978j38626
2741I42601776j20621l1356J19781K16141J48544l9825j95465k34452k05307j88827
2751I42070389k03858k24533k21023j59378j7319J73645L31192L88489L33252J85318
2761I42656174j2131j72730k01797r1782N2262J20010J00708N1041l739q5373j92031
2772I42220612k65198k41623j17340L9825J32294R9106k5330j22452r4528L0670J27106
2783I41783142J10321K6550j7547J5945P3395R4452P0038J2283p4768j65939k02256
$$ plain form
2711 940143661 939778519 939385071 939053955 938901672 938980789 939229889 939528580 939797134 940036392 940290222
2721 940290222 940591278 940932770 941274490 941579819 941852798 942119827 942363663 942505569 942484741 942342987
2731 942342987 942201920 942167358 942272491 942484589 942724609 942894745 942935257 942864380 942740402 942601776
2741 942601776 942481155 942449799 942569580 942785721 942934265 942894440 942698975 942464523 942259216 942070389
2751 942070389 941866531 941641998 941420975 941261597 941244278 941417923 941749115 942137604 942470856 942656174
2761 942656174 942644043 942471313 942269516 942177734 942229996 942350006 942450714 942501755 942498016 942412643 942220612
2772 942220612 941955414 941713791 941596451 941636276 941768570 941867676 941842346 941719894 941625366 941656036 941783142
2783 941783142 941893463 941920013 941902466 941918411 941991806 942086258 942156296 942168579 942093811 941927872 941725616
2794I41725616j64718j29318j86081l07846l67432k96784j67160q5983p5760j05056
2804I39839478j79139l32031n42984p30896q38089q75625q80814q64029p98950o32477
2814I33164444l11661J57318O60248J024017J135636J010513P53708M81110K71072
2823I38346405J53580J19552J51062K38572L56979M47540M61044M16260L73307L50036
2833I41414337L08991K29263J36642M3106q0566k36969l53622l59269k78167j95313
2843I40628433j42288p0877N8670K10114L12957L38898L10822K50701J46027j8921
2853I42024536k04620l08686k46200m4632J54495K09046R0484j06735k36282j91422
2863I41139984K2278K67334L69797K83661J34964P4005J09405J36719R9335M8065M2114
$$ plain form
2794 941725616 941560898 941431580 941245499 940937653 940570221 940273437 940106277 940020294 939944534 939839478
2804 939839478 939660339 939328308 938785324 938054428 937216339 936340714 935459900 934595871 933796921 933164444
2814 933164444 932852783 933010101 933670349 934694366 935830002 936840515 937594223 938075333 938346405
2823 938346405 938499985 938619537 938770599 939009171 939366150 939813690 940274734 940690994 941064301 941414337
2833 941414337 941723328 941952591 942089233 942132339 942051773 941814804 941461182 941101913 940823746 940628433
2843 940628433 940486145 940415268 940473938 940684052 940997009 941335907 941646729 941897430 942043457 942024536
2853 942024536 941819916 941511230 941265030 941220398 941374893 941583939 941674423 941567688 941331406 941139984
2863 941139984 941162262 941429596 941799393 942083054 942218018 942292023 942401428 942538147 942637482 942685547 942727661
2874I42727661O7749Q0109O2561J0071q4687j72195j36795O3095K77481K89612P2479
2885I43257141j65100k25372j28479k9373p477j9150j3046N798K0523L7918N6153M7607
2897I42837143n035q3619j48086j53351p4310N4321J33057Q9264j8006n5847J7319
2908I42592850J00555Q4915k2735j33133j77384j40152m3411N6839R6283P1259N3634
2919I42539520Q9646J23214P4082l7003j02615n1651Q8348K22702K33612N0354k42386
2930I42987823m12673l07847n8746M4785r9488k82898k50930j2970J81961J34811j09711
2941I41814117l36532l75824k43912r8266o5690j10702r1400N6610K20718K23618J6937
2952I41009674k60849m13513l63846k05612j03226j42975k76565l98102m61578n12696
$$ plain form
2874 942727661 942795410 942875519 942938080 942948151 942863464 942691269 942554474 942617569 942895050 943184662 943257141
2885 943257141 943092041 942866669 942738190 942708817 942701340 942682190 942669144 942674942 942695465 942733383 942789536 942837143
2897 942837143 942832108 942748489 942600403 942447052 942372742 942427063 942560120 942649384 942631378 942575531 942592850
2908 942592850 942693405 942778320 942755585 942622452 942445068 942304916 942261505 942318344 942414627 942485886 942539520
2919 942539520 942629166 942752380 942826462 942789459 942686844 942635193 942723541 942946243 943179855 943230209 942987823
2930 942987823 942575150 942267303 942208557 942253342 942153854 941870956 941620026 941607056 941789017 941923828 941814117
2941 941814117 941477585 941101761 940857849 940759583 940693893 940583191 940491791 940548401 940769119 940992737 941009674
2952 941009674 940748825 940335312 939971466 939765854 939662628 939519653 939243088 938844986 938383408 937870712
2962I37870712o13022p58514q81424r11407q17566o02494k85949R1095M57382P26852
2972I34275665Q37937P79648N82199K92739l8757l70712o79932r48105j109924j033325
2982I32587433o20117M1809O82220J065293J180648J176606J132125R83048O82831
2991I38911896L38211J22299Q9798J48697J87988J74866J24740M1733o7215j55945
3001I39917068j67007j04217m7074p4692j78299k60391k26669p1640J22223K49405
3011I39158707K47345J23596m9362j71509j77765q8043M425J1062p7362j90811k48260
3022I38542023k21329j45340q2932p6675j25198j89591k19726j85776j00327j1139
3032I37183990L5096K5863k5406j02233j78376k12707j75095p5836M4327J46560J96534
$$ plain form
2962 937870712 937257690 936499176 935617752 934706345 933888779 933286285 933000336 933091431 933548813 934275665
2972 934275665 935113602 935893250 936475449 936768188 936729431 936358719 935678787 934730682 933620758 932587433
2982 932587433 931967316 932009125 932691345 933756638 934937286 936113892 937246017 938229065 938911896
2991 938911896 939250107 939372406 939462204 939610901 939798889 939973755 940098495 940140228 940073013 939917068
3001 939917068 939750061 939645844 939598770 939524078 939345779 939085388 938858719 938787079 938909302 939158707
3011 939158707 939406052 939529648 939480286 939308777 939131012 939042969 939047394 939058456 938981094 938790283 938542023
3022 938542023 938320694 938175354 938092422 938015747 937890549 937700958 937481232 937295456 937195129 937183990
3032 937183990 937219086 937244949 937219543 937117310 936938934 936726227 936551132 936475296 936519623 936666183 936862717
3043I36862717J50070j7395k62222m88358o28204o79093o64215o07300n63659o14777
3053I32487564p84302r98611j189346j415177j809769k421646l194351m098511n150604
3062I11425247o185150o663818n913697l766327j003189J039734J499024O19430o22940
3071H90428314j455917j764984j661606q72269J126938M297562P588196R524383R328156
3080I16538773P443161N012207K985534J695175J011429O72150M71115L07541J87530
3089I36324615J68381K53372L39661L03421J34125n3559j51214j63574j59531j59836
3099I36835861j23977l3722N7220O6605m2267k35596m25415n10559m47388k95715j68304
3110I34676743j30387j67389k34070l05557l82843m80041o08521p48215q44268q69370
$$ plain form
3043 936862717 937012787 936995392 936733170 936244812 935616608 934937515 934273300 933666000 933102341 932487564
3053 932487564 931703262 930704651 929515305 928100128 926290359 923868713 920674362 916575851 911425247
3062 911425247 905240097 898576279 892662582 888896255 887893066 888932800 890431824 891051254 890428314
3071 890428314 888972397 887207413 885545807 884673538 885800476 890098038 897686234 907210617 916538773
3080 916538773 923981934 928994141 931979675 933674850 934686279 935358429 935829544 936137085 936324615
3089 936324615 936492996 936746368 937086029 937389450 937523575 937470016 937318802 937155228 936995697 936835861
3099 936835861 936711884 936678162 936735382 936801987 936759720 936524124 936098709 935588150 935140762 934845047 934676743
3110 934676743 934546356 934378967 934144897 933839340 933456497 932976456 932367935 931619720 930775452 929906082
3120I29906082q89892j017609j264954j470413j423035j062774n22003K6779N33371
3129I22815552J063232J636353K110519K272186K059098J646881J270370J014328Q30765
3138I36719284O88553O08063N75409N18798M00391K61993J52436O9885P782n264L5324
3149I40032654O7901L8147j5869j7471L9291R8191J39465J92337K51312K58332J96609
3160I41280899J37329J42746J66016J13220j4038r9411n2872P2327J38855Q3236k1209
3171I41947098n7602L586Q6898J06125N1651j3199j6021O6604J86005K41852J62048
3182I42765045r918j33209j14289k1209L814o3324j02081k7695R1095J44120J37252
3193I42669601J49231J77842J34735p63j17188j04446M577P9651M3412o7978j59760
$$ plain form
3120 929906082 929016190 927998581 926733627 925263214 923840179 922777405 922255402 922282181 922815552
3129 922815552 923878784 925515137 927625656 929897842 931956940 933603821 934874191 935888519 936719284
3138 936719284 937407837 938015900 938591309 939110107 939510498 939772491 939924927 939994812 940002594 939997330 940032654
3149 940032654 940100555 940138702 940122833 940105362 940144653 940242844 940382309 940574646 940825958 941084290 941280899
3160 941280899 941418228 941560974 941726990 941840210 941826172 941726761 941673889 941746216 941885071 941968307 941947098
3171 941947098 941889496 941893082 941979980 942086105 942137756 942124557 942108536 942175140 942361145 942602997 942765045
3182 942765045 942755127 942621918 942507629 942486420 942490234 942426910 942324829 942297134 942388229 942532349 942669601
3193 942669601 942818832 942996674 943131409 943130646 943013458 942909012 942913589 942993240 943036652 942968674 942808914
3204I42808914j57699n5542Q2473J74866J96152J83487J67083J28480N7296N341L0670
3215I43621521J03989J30920P1335j8005o2104l9673L1052J26572K09045K20871J33057
3226I44528580j1292j34277k01874k36740k56958k38800j56174l4332N7526O6604Q39
3237I43383102p7743j01700m9362L9673R1858N1040p8659k19421k60391j39847R1095
3248I42729645L00674L82309L28674K10419R4528P7p7744j30386j39160r9259k9297
3259I43570480K9526K2202q0796k32620l11203k14462K4643K40707K88391J82419O6300
3270I43585587M5242P9193N8899l4866r4071k0141J42135K42081J75476l0441k58026
3281I43891068l82920l36380j45492O5231J50452O4163r8572j91421j43280m120J03836
$$ plain form
3204 942808914 942651215 942595673 942678146 942853012 943049164 943232651 943399734 943528214 943585510 943590851 943621521
3215 943621521 943725510 943856430 943927765 943909760 943847656 943807983 943839035 943965607 944174652 944395523 944528580
3226 944528580 944517288 944383011 944181137 943944397 943687439 943448639 943292465 943258133 943315659 943382263 943383102
3237 943383102 943305359 943203659 943154297 943193970 943285828 943336868 943258209 943038788 942778397 942638550 942729645
3248 942729645 943030319 943412628 943741302 943951721 944046249 944046326 943968582 943838196 943699036 943599777 943570480
3259 943570480 943600006 943622208 943541412 943308792 942997589 942783127 942807770 943048477 943336868 943519287 943585587
3270 943585587 943630829 943710022 943768921 943734055 943639984 943619843 943761978 944004059 944179535 944149094 943891068
3281 943891068 943508148 943171768 943026276 943091507 943241959 943306122 943207550 943016129 942872849 942868729 942972565
3292I42972565P5760q9951k68249k95716j19324J38474K91672K73742J81809J39923
3302I43300705J70975K17971K45667K61993K56882J84937L1662j36719k28958k21405
3312I44083710j64643j08261n3634J4190P2708N6076q0184k79847l83300k54136O0425
3323I42963104L28217L45154J40075p3394j42289r6664k9068N0278J66626K62832K29264
3334I44144135M9819j59149k69394k54898j69906o2332N1879J59455K34451K53372
3344I43977432K14920J41907N9357l3188j54953k85034l32108k12784L2578K45819
3354I43653946K96020J94931O1188j831J9608O4315M7226p3547k43454l42483l00141
3365I43375778j62735k1591R1629J92871K61459K42081J33057J373j11999k33078l56827
$$ plain form
3292 942972565 943048325 942958374 942690125 942394409 942275085 942413559 942705231 942978973 943160782 943300705
3302 943300705 943471680 943689651 943935318 944197311 944454193 944639130 944670792 944534073 944305115 944083710
3312 944083710 943919067 943810806 943757172 943771362 943844070 943900146 943819962 943540115 943156815 942902679 942963104
3323 942963104 943291321 943636475 943776550 943703156 943560867 943464203 943435135 943485413 943652039 943914871 944144135
3334 944144135 944193954 944034805 943765411 943510513 943340607 943278275 943330154 943489609 943724060 943977432
3344 943977432 944192352 944334259 944393616 944360428 944205475 943920441 943588333 943375549 943408127 943653946
3354 943653946 943949966 944144897 944206085 944204254 944223862 944288177 944335403 944261856 944018402 943675919 943375778
3365 943375778 943213043 943191452 943283081 943475952 943737411 943979492 944112549 944113922 944001923 943768845 943412018
3376I43412018l78647k05307R1705L19519L72925L23486K82441K47802J47095j4877
3386I44598160j30158j19857k4338N9509P6675K8382o1646j44348j48392n6228L9825
3397I44117584J2131j47705k98386l01208j62812J984J06888J55640J85012J96763
3407I43865891J62582P2403l1510p2326p782J08871J58615P4845p9804j77459j58768
3418I43915558p9498l4409m9591n7144J9912J59760K54898K36435J47018P2098K7771
3429I44612808l3417j11312j30005n3940K9678J0758j07346k17132k36512j70135n2185
3440I43541260J08948K82287L66898K85568J05514k5787n8441r8038k19574l12195
3450I43976440k27813J5564K44140K92359J41372r9640l03726m05655l95813k76184
$$ plain form
3376 943412018 943033371 942828064 942919769 943239288 943612213 943935699 944218140 944465942 944613037 944598160
3386 944598160 944468002 944348145 944323807 944383316 944459991 944488373 944426727 944282379 944133987 944077759 944117584
3397 944117584 944129715 943982010 943683624 943382416 943219604 943221588 943328476 943484116 943669128 943865891
3407 943865891 944028473 944100876 944069366 943997040 943989258 944098129 944256744 944331589 944251785 944074326 943915558
3418 943915558 943836060 943801651 943752060 943694916 943714828 943874588 944129486 944365921 944512939 944585037 944612808
3429 944612808 944579391 944468079 944338074 944284134 944313812 944324570 944217224 944000092 943763580 943593445 943541260
3440 943541260 943650208 943932495 944299393 944584961 944690475 944664688 944606247 944508209 944288635 943976440
3450 943976440 943748627 943764191 944008331 944300690 944442062 944342422 944038696 943633041 943237228 942961044
3460I42961044m3182K57416M84008M92478K96631O2561q1940j68915k80456l79029
3470I43600616l40271j35040J06964K24076J64184m120j63116k10037r9335J29928
3480I43273849L56064M33121L10135R2545n3101m5776Q4991K30942K52914R3613j50528
3491I44878769l10898k97165j52130K1668J49459K00119J57624K8686j26419k12555
3501I44337158j53198L8605K28958K86178K06070M8981j41373k99911l52326k80609
3511I43918533j36642J7624J49460K30484K18887J17569j7090j42441k58865l37524
3521I43759995k76490p553L37753M93622L57514J02844m5929m6234j3428m2953j38092
3532I44481049k47269k98386k05917L1357K51770K65121J00556l6927m2495M806Q774
$$ plain form
3460 942961044 942917862 943175278 943659286 944151764 944448395 944510956 944429016 944260101 943979645 943600616
3470 943600616 943260345 943125305 943232269 943456345 943620529 943616409 943453293 943243256 943143921 943273849
3480 943273849 943629913 944063034 944373169 944465714 944412613 944366837 944451828 944682770 944935684 945029297 944878769
3491 944878769 944567871 944270706 944118576 944140244 944289703 944489822 944647446 944676132 944549713 944337158
3501 944337158 944183960 944222565 944451523 944737701 944943771 944992752 944851379 944551468 944199142 943918533
3511 943918533 943781891 943799515 943948975 944179459 944398346 944515915 944498825 944356384 944097519 943759995
3521 943759995 943483505 943475952 943813705 944307327 944664841 944767685 944721756 944675522 944662094 944619141 944481049
3532 944481049 944233780 943935394 943729477 943760834 944012604 944277725 944378281 944341354 944298859 944303665 944312439
3543I44312439K8534K04620M96598N87768K57034k88848o96640p77359n15824j04904
3553I43503418J31912O9809j08261j84936j01166N9814J88523K44598L01514M30069
3563I44535294N30014L98407R4452o4316p2632j67313k84042l16162k92816k19651
3573I44141235m4708J98135L71247L46680J53198p2098j97754j57318N9738M12521
3583I45210876P15256O96030L30047N0354O9123j6632k98767m41742m13742l21961
3593I45578842j00097K89154O13937N86853J74866l66593o82220n72586k16980Q7662
3603I45392838K25372J82953p7896l89328l54004J29165O18363P04345N16205M91867
3613I47439880P45469R16290O98929J35955m20379n22919l47443n01709r31396j100235
$$ plain form
3543 944312439 944340973 944545593 945042191 945629959 945886993 945598145 944901505 944124146 943608322 943503418
3553 943503418 943635330 943705139 943596878 943411942 943310776 943370590 943559113 943803711 944105225 944535294
3563 944535294 945065308 945463715 945558167 945493851 945421219 945253906 944969864 944653702 944360886 944141235
3573 944141235 944096527 944294662 944665909 945012589 945165787 945093689 944895935 944738617 944798355 945210876
3583 945210876 945926132 946622162 946952209 947002563 947071686 947055054 946756287 946314545 945900803 945578842
3593 945578842 945478745 945767899 946381836 946968689 947143555 946776962 946094742 945522156 945305176 945392838
3603 945392838 945618210 945801163 945723267 945333939 944979935 945109100 945727463 946431808 946948013 947439880
3613 947439880 948185349 949101639 949800568 949936523 949516144 948993225 948645782 948144073 947212677 946112442
3623I46112442o80618K37732R54971O36902J9836O54068J390991N65567o32400j110230
3633I48149261r35440n41458l65371l62854k44980j3275M0130j48544k85568j17035
3643I45174866L20968P94449J100769J144562J010056J033935J081619K86103q98590
3652I51048737j374970j409454j411972j016922k57645M0054k66952n35889l73077
3661I44441910P0724M45710N68923N44663N21469L28674l21884q29391r2011J225281
3671I46904068J684494J062775k85492p87506L01818O48270o25381j612702j461487
3680I45828857p21588j54953O5689K47651N63583P04574L69111k8382K47116R20258
3690I48041916Q77228M5852o62841r00956r02404o98624k25678K84806M59900K75116
$$ plain form
3623 946112442 945431824 945669556 946624527 947261429 947281265 947935333 949326324 949891891 949259491 948149261
3633 948149261 947213821 946672363 946306992 945944138 945699158 945685883 945726013 945577469 945291901 945174866
3643 945174866 945495834 946290283 947391052 948535614 949545670 950579605 951661224 951947327 951048737
3652 951048737 949673767 948264313 946852341 945835419 945577774 945617828 945350876 944814987 944441910
3661 944441910 944512634 944958344 945527267 946071930 946593399 946922073 946600189 945770798 945678787 946904068
3671 946904068 948588562 949651337 949365845 948578339 948880157 949528427 948903046 947290344 945828857
3680 945828857 945107269 944952316 945018005 945265656 945829239 946533813 946902924 946874542 947121658 948041916
3690 948041916 948919144 948964996 948302155 947401199 946498795 945800171 945574493 945859299 946319199 946594315
3700I46594315J30844K39181K68707j4877l04184l31497j30920Q0185J03759k1286
3710I46614227K5711K65885J83105k23541m77600m24347p3242N20935J021957J053238
3720I48486328O31333J69372r3460l67432q21151j071320o68945J70059Q60214J054382
3730I48349380R16825Q20007O80161J96380k10190J53K11029l68957j257401j391907
3740I47945480n69305r4223r03015j130295M15878J634064J329193M26025k67639k35366
3750I48550797N28717R84420M82331j75400m66995n87922o94427p57141o39877l01438
3760I46923065j3275k8915l87040p76443o53687K2507N33524L44314j06125n0430L55759
3771I46163254L57437r3002l81241k10495O9046n7297n01938n99747j03073L58200
$$ plain form
3700 946594315 946725159 946964340 947233047 947218170 946913986 946582489 946451569 946531754 946635513 946614227
3710 946614227 946639938 946905823 947088928 946865387 946387787 945963440 945890198 946411133 947433090 948486328
3720 948486328 949117661 949287033 949193573 948826141 948004990 946933670 946264725 946434784 947294998 948349380
3730 948349380 949266205 950086212 950766373 950962753 950752563 950752716 950963745 950594788 949337387 947945480
3740 947945480 947376175 947281952 946378937 945248642 945664520 947298584 948627777 949053802 948786163 948550797
3750 948550797 949079514 950063934 950546265 950370865 949903870 949315948 948621521 947864380 947224503 946923065
3760 946923065 946909790 946880875 946493835 945717392 945063705 945086212 945619736 945964050 945857925 945807495 946163254
3771 946163254 946520691 946427689 946046448 945835953 945904999 945847702 945345764 944746017 944642944 945001144
3781I45001144K53373k17667m88358k50473K22092L82462N7983m46777p55387o79779
3791I43078613l01590L8987K059j94854J15280R68552J357040L83911j536713k297821
3801I41613464o46438J483307J922531Q61130l52173o34461k90069k51313n16281n03158
3811I42686539q40M68674K52609n8212P09839K032089K320633J104508m69895n57632
3821I48488312M64325N17349m04053j147842j162262n43900K8229K4872l29743m63180
3831I45472107p6523N27420Q42819P05033L03116K3040K00959O27288O35605O11p54548
3842I48506927j118545j040268q41522p77436q59756p80563j25351R60846J256714
3851I45181046J48925l00979R47494J262589P8048p04879o33469k01492K03552M26178
$$ plain form
3781 945001144 945254517 945036850 944548492 944298019 944520111 944902573 944960556 944513779 943758392 943078613
3791 943078613 942777023 942816010 942818069 942623215 942738495 943707047 945064087 945447998 943911285 941613464
3801 941613464 940967026 942450333 944372864 945233994 944881821 944247360 943957291 943705978 943189697 942686539
3811 942686539 942685699 943154373 943406982 943348770 944058609 946090698 948411331 949515839 949045944 948488312
3821 948488312 948952637 949469986 949065933 947918091 946755829 946211929 946240158 946265030 945935287 945472107
3831 945472107 945395584 945923004 946765823 947470856 947773972 947797012 947997971 948625259 949260864 949261475 948506927
3842 948506927 947388382 946348114 945506592 944729156 943869400 943088837 942963486 943924332 945181046
3851 945181046 945329971 945028992 945976486 947239075 947317123 946612244 945978775 945777283 945980835 946407013
3861I46407013M48532L05176K65198M04510M87824K37808m69208r03244k11792P84683
3871I47756500P30438j27029n71136j79749M14887N56793O0501o84662q33283k55279
3881I46867981K11105K5559n52674p06634j0147P34558P64694K09732l77121l30353
3891I46836700K58637M01382j36718n29175l59268J7700L19977O17523Q73031P57447
3901I49057236K02255l23639l88412j70746j26725k95410m47158m96903m82712m18854
3911I46108932k62527n8441Q4686R9945R7428J77612K78168K99072K69318K23999Q4152
3922I47402344j91040m17404m02985k28806p5149K6016J10092J71433K02942K29034
3932I46826477K18964Q4304j77917m36096m79737k17056J72577L82996K99988J14440
$$ plain form
3861 946407013 946855545 947160721 947425919 947830429 948318253 948556061 948086853 947183609 946971817 947756500
3871 947756500 948486938 948359909 947788773 947609024 948023911 948580704 948641205 947956543 947123260 946867981
3881 946867981 947079086 947104645 946551971 945845337 945835190 946569748 947334442 947544174 947167053 946836700
3891 946836700 947095337 947496719 947360001 946830826 946471558 946489258 946809235 947426758 948299789 949057236
3901 949057236 949259491 948935852 948547440 948376694 948249969 947954559 947507401 947010498 946527786 946108932
3911 946108932 945846405 945787964 945872650 945972595 946070023 946247635 946525803 946824875 947094193 947318192 947402344
3922 947402344 947211304 946793900 946390915 946162109 946086960 946112976 946223068 946394501 946597443 946826477
3932 946826477 947045441 947129745 946951828 946515732 946035995 945818939 945991516 946374512 946674500 946788940
3942I46788940J1750o4316k17590l85514m27398k84653m7150J32370J96686K02103
3952I45905228J87072J15128m8523k61383l99704l54462j46560R0484K26975K30713
3962I45544968J37329k3270k40555m58221n38712l59115L0975L83530M51126K28729
3972I45156784l5706q8043R2697K99988L23563J48620p1258j86386j62125m8218R3613
3983I45523529K11105K51160J74637m883k03705l00522k11486K1514K24686K23313
3993I45909348J602k74430m08249l30657j31684j33056j32599
4000I44500275
$$ plain form
3942 946788940 946800690 946736374 946518784 946133270 945705872 945421219 945374069 945506439 945703125 945905228
3952 945905228 946092300 946207428 946158905 945897522 945497818 945143356 944996796 945087280 945314255 945544968
3962 945544968 945682297 945659027 945418472 944960251 944421539 944062424 944093399 944476929 944928055 945156784
3972 945156784 945121078 945033035 945125732 945425720 945749283 945897903 945826645 945640259 945478134 945429916 945523529
3983 945523529 945734634 945985794 946160431 946155548 945951843 945651321 945439835 945461349 945686035 945909348
3993 945909348 945910950 945636520 945228271 944897614 944765930 944632874 944500275
4000 944500275
##END=$$ End of the data block
