##TITLE=$$ Begin of the data block
##JCAMP-DX=5.00 $$ ACD/SpecManager v 12.01
##DATE=20 Mar 2009 10:21:02
##DATA TYPE=INFRARED SPECTRUM
##DATA CLASS=XYDATA
##ORIGIN=
##OWNER=
##NPOINTS=7053
##FIRSTX=599.86669922
##LASTX=4000.39697266
##MAXX=4000.39697266
##MINX=599.86669922
##MAXY=85.82855988
##MINY=7.06513023
##XFACTOR=1.0000000000
##YFACTOR=0.000000100000000
##FIRSTY=44.99409103
##DELTAX=0.48220792
##XUNITS=1/CM
##YUNITS=TRANSMITTANCE
##XYDATA=(X++(Y..Y))
$$ plain form
599.9 449940910 450244942 444652061 443243141 452852135 462886963 467012939 472603645 471369553
603.7 471369553 475348511 474320602 476749077 476430473 470064125 477267151 490290756 499563293
607.6 499563293 502596397 499853210 495015450 488204346 493832664 509140739 509892845 503855286
611.4 503855286 505847816 512495651 516056061 519947815 519793510 516432419 515812225 522747459 523973465
615.8 523973465 522321243 523412933 529507103 538383598 550088310 554000015 545720749 548733368
619.6 548733368 555657997 551935043 555923691 557221489 554892883 554843445 552815666 555347137 558136139
624 558136139 565617332 575886726 571510353 574543724 575903168 572376747 574340477 580992699 584323502
628.3 584323502 584511032 587379379 592974472 588250656 580851173 586579971 597376328 604152336
$$ packed form
599.9D49940910L04032n592881j408920R608994J0034828M125976N590706j234092
603.7D71369553L978958j027909K428475l18604o366348P203026J3023605R272537
607.6D99563293L033104k743187m837760o811104N628318J5308075P52106o037559
611.4E03855286J992530O647835L560410L891754j54305l361091o20194O935234J226006
615.8E23973465j652222J091690O094170Q876495J1704712L911705q279266L012619
619.6E48733368O924629l722954L988648J297798k328606m9438k027779K531471K789002
624E58136139P481193J0269394m376373L033371J359444l526421J963730O652222L330803
628.3E84323502J87530K868347N595093m723816p399483N728798J0796357O776008
$$ plain form
632.2 604152336 607893448 604221344 604555054 606446533 607114677 610055504 619801674 620196800 612694359
636.5 612694359 613530502 618645325 623896141 624641151 623603592 625249176 630778847 628374825 629291573
640.9 629291573 638557053 638605766 631036224 637524567 648865280 653169937 650532150 640395737
644.7 640395737 646025467 652237854 653181076 660569077 673088074 673684845 665097809 671262589 684264679
649.1 684264679 671715698 668999405 668978653 663625793 666988144 677101212 680922546 683537445
652.9 683537445 688601379 681525116 673431778 675953217 677683182 677690887 690043640 691080933 681419830
657.2 681419830 686267548 695638733 685031738 683253021 689986877 689578247 688093338 688414764 693410568
661.6 693410568 693015213 691709137 700472260 704003220 696174545 699795837 710102234 709256058 706357422
$$ packed form
632.2F04152336L741112l672104L33710J891479O68144K940827R746170L95126p502441
636.5F12694359Q36143N114823N250816P45010j037559J645584N529671k404022R16748
640.9F29291573R265480M8713p569542O488343J1340713M304657k637787j0136413
644.7F40395737N629730O212387R43222P388001J2518997N96771q587036O164780J3002090
649.1F84264679j2548981k716293k0752n352860L362351J0113068L821334K614899
652.9F83537445N063934p076263q093338K521439J729965P705J2352753J037293r661103
657.2F81419830M847718R371185j0606995j778717O733856m08630j484909L21426M995804
661.6F93410568l95355j306076Q763123L530960p828675L621292J0306397q46176k898636
$$ plain form
665.9 706357422 712225876 722025604 741062546 779823303 753865280 728377991 713304214 712912827
669.8 712912827 711683807 708038330 709671936 711498260 717083740 723749619 717559891 716742172 724738693
674.1 724738693 727542267 715702362 710772476 714480133 720484161 723392715 720442657 710754471
678 710754471 703645706 709761429 719823380 719456253 711843109 711124496 711465378 712382050 717100525
682.3 717100525 717732849 720235062 726979294 729628830 731638107 743159332 747381516 742813644
686.2 742813644 742040634 747319260 735975189 735084381 746299896 743718948 740077133 741319885
690 741319885 745717392 743510742 740201340 743486328 746125412 744052277 742105026 742950974 741983643
694.4 741983643 740308304 744051666 744007111 737060089 735574265 738683548 738316650 738819733 741515579
$$ packed form
665.9G06357422N868454R799728J9036942L8760757k5958023k5487289j5073777l91387
669.8G12912827j229020l645477J633606J826324N585480O665879o189728q17719P996521
674.1G24738693K803574j1839905m929886L707657O004028K908554k950058r688186
678G10754471p108765O115723J0061951l67127p613144p18613L40882R16672M718475
682.3G17100525O32324K502213O744232K649536K009277J1521225M222184m567872
686.2G42813644p73010N278626j1344071q90808J1215515k580948l641815J242752
690G41319885M397507k206650l309402L284988K639084k073135j947251Q45948r67331
694.4G41983643j675339L743362m4555o947022j485824L109283l66898N03083K695846
$$ plain form
698.7 741515579 737428589 735839844 728763733 719361115 720737076 726340103 721817398 715174332
702.6 715174332 711382141 716414185 718933945 722048416 727174072 728379593 727011948 727518997 730245972
706.9 730245972 730942459 734416580 747733231 753529968 745380707 744365845 750369263 753898392
710.8 753898392 755733414 759314728 764578400 767658005 766777420 767945175 769251785 765384216 764914703
715.1 764914703 771052856 769144592 768032455 772789383 770707474 773172684 778963928 775971985
719 775971985 773754272 771803589 774621048 783069077 788292923 783405914 777040634 780026245 781427689
723.3 781427689 782505188 783753052 784569855 787444305 788982162 784416656 781711121 786852722 788635254
727.7 788635254 789949799 792456284 791409225 791148605 784898758 782723999 788850174 798637772 805536499
$$ packed form
698.7G41515579m086990j588745p076111r402618J375961N603027m522705o643066
702.6G15174332l792191N032044K519760L114471N125656J205521j367645N07049K726975
706.9G30245972O96487L474121J3316651N796737q149261j014862O003418L529129
710.8G53898392J835022L581314N263672L079605q80585J167755J306610l867569m69513
715.1G64914703O138153j908264j112137M756928k081909K465210N791244k991943
719G75971985k217713j950683K817459Q448029N223846m887009o365280K985611J401444
723.3G81427689J077499J247864Q16803K874450J537857m565506k705535N141601J782532
727.7G88635254J314545K506485j047059k60620o249847k174759O126175R787598O898727
$$ plain form
732 805536499 803698120 796351395 795992584 801358109 801879654 803652115 802210922 800551605 803879471
736.3 803879471 807761841 806888351 800935593 801132736 807513275 809042969 810999756 808953018 803550034
740.7 803550034 805528259 807637482 808421555 808230438 809206161 811171265 812339783 810772476 809955826
745 809955826 814081802 814002380 810392761 807989883 808957825 811682053 815360718 817906189 818327255
749.4 818327255 818841782 819696960 822160645 817552643 810036087 813248138 816786804 816267548 810427399
753.7 810427399 807570648 814183655 815171509 815448151 822604370 822097931 820411606 820446701 823122711
758 823122711 823935547 820661697 816634064 815499649 810333328 813063507 817517700 818478012 818471451
762.4 818471451 820455933 824574890 828688736 826357117 823699646 827333832 833037643 832889786 827645035
$$ packed form
732H05536499j838379p346725l58811N365525N21545J772461j441193j659317L327866
736.3H03879471L882370q73490n952758J97143O380539J529694J956787k046738n402984
740.7H03550034J978225K109223P84073j91117R75723J965104J168518j567307q16650
745H09955826M125976p9422l609619k402878R67942K724228L678665K545471M21066
749.4H18327255N14527Q55178K463685m608002p516556L212051L538666n19256n840149
753.7H10427399k856751O613007R87854K76642P156219n06439j686325L5095K676010
758H23122711Q12836l273850m027633j134415n166321K730179M454193R60312o561
762.4H18471451J984482M118957M113846k331619k657471L634186N703811j47857n244751
$$ plain form
766.7 827645035 828514023 822925491 819347992 821914673 825282364 826611023 822731476 820901031 827069855
771.1 827069855 824699554 824900513 824444046 820361404 820524216 821267929 819763947 823602142 828073959
775.4 828073959 826029892 825349121 825856934 827599716 828859787 826501312 821931534 823440628 833080597
779.7 833080597 832369003 824435654 823371506 823288803 827675095 831688919 829419479 821957092 820601501
784.1 820601501 830864792 832409363 832576675 826440353 815453568 816545944 818602371 819556427
787.9 819556427 821399307 821203079 823791428 820321198 815337448 819777374 818739014 815911942 817763214
792.3 817763214 817866440 812357635 807954559 801070099 799739380 796804199 797554092 796597977 786710129
796.6 786710129 788195724 784083405 778097610 773429642 773048401 770140228 760651169 749124908
$$ packed form
766.7H27645035Q68988n588532l577499K566681L367691J328659l879547j830445O168824
771.1H27069855k370301K00959m56467m082642J62812P43713j503982L838195M471817
775.4H28073959k044067o80771N07813J742782J260071k358475m569778J509094R639969
779.7H33080597p11594p933349j064148q2703M386292M013824k269440p462387j355591
784.1H20601501J0263291J544571J67312o136322j0986785J092376K056427R54056
787.9H19556427J842880j96228K588349l470230m983750M439926j038360k827072J851272
792.3H17763214J03226n508805m403076o884460j330719k935181P49893r56115r887848
796.6G86710129J485595m112319n985795m667968l81241k908173r489059j1526261
$$ plain form
800.5 749124908 741374054 742311401 748332596 751973343 749527512 748118515 753342514 755995636 759139938
804.8 759139938 767088242 771123352 768467712 769312057 775201874 780793304 785914230 788386993 790017776
809.1 790017776 788292694 787161636 792569199 804023056 807246475 805704727 807973328 812877350
813 812877350 811515656 811989288 814475021 817858200 818363647 818170090 818998947 821058502 820314636
817.3 820314636 823574829 823926544 821856079 826995316 833026276 824039001 815734711 816212540 824873276
821.7 824873276 824393921 821506729 828220367 832352600 833224335 831472473 829498291 829444427 828339539
826 828339539 824328537 820353622 826211700 827997055 823322678 824551544 821562347 818772125 818046112
830.4 818046112 817983856 825487061 827135315 828557434 829433136 825536041 827420044 828536072 822294693
$$ packed form
800.5G49124908p750854R37347O021195L640747k445831j408997N223999K653122L144302
804.8G59139938P948304M035110k655640Q44345N889817N591430N120926K472763J630783
809.1G90017776j725082j131058N407563J1453857L223419j541748K268601M904022
813H12877350j361694M73632K485733L383179N05447j93557Q28857K059555p43866
817.3H20314636L260193L51715k070465N139237O030960q987275q304290M77829Q660736
821.7H24873276m79355k887192O713638M132233Q71735j751862j974182n3864j104888
826H28339539m011002l974915N858078J785355m674377J228866k989197k790222p26013
830.4H18046112o2256P503205J648254J422119Q75702l897095J884003J116028o241379
$$ plain form
834.7 822294693 819865417 824111710 828620529 830255356 824913177 818506546 813951263 815689774
838.6 815689774 823129044 828326263 824202042 817234039 822338943 823382263 812819061 813821640
842.4 813821640 820766602 821304626 819552994 821877441 822568436 826568680 830335159 825468750 828293610
846.8 828293610 828671036 817730484 820901337 828850708 826564789 831934204 831679382 822701569 808545761
851.1 808545761 812166214 814616013 805095825 802734222 809013977 815147018 814940872 809242249 809495773
855.4 809495773 808025818 814993515 815766373 809432068 810085754 812672653 811213608 810668182 806994324
859.8 806994324 809183350 814227600 813093414 808244553 807673340 809276733 810873947 806776962 806662674
864.1 806662674 807559738 803901825 802196960 802054596 800072174 800642014 800207901 794247971 795227356
$$ packed form
834.7H22294693k429276M246293M508819J634827n342179o406631m555283J738511
838.6H15689774P439270N197219m124221o968003N104904J043320j0563202J002579
842.4H13821640O944962N38024j751632K324447O90995M000244L766479m866409K824860
846.8H28293610L77426j0940552L170853P949371k285919N369415k54822q977813j4155808
851.1H08545761L620453K449799r520188k361603O279755O133041k06146n698623K53524
855.4H09495773j469955O967697P72858o334305O53686K586899j459045n45426l673858
859.8H06994324K189026N044250j134186m848861n71213J603393J597214m096985j14288
864.1H06662674Q97064l657913j704865j42364j982422N69840m34113n959930R79385
$$ plain form
868.5 795227356 796514435 797385712 794439392 781034775 777439957 782482910 787613068 787867584 786530228
872.8 786530228 781836166 770781555 761846619 764278412 769339447 765505066 751744080 744585800
876.7 744585800 736283188 729672165 730056229 720802536 714659653 704375687 688549423 678946686
880.5 678946686 672027054 662243881 652243881 637142258 618770790 606330299 598291740 589429436
884.4 589429436 576935616 568593521 566727829 556877556 544583626 539086342 531447144 520895576
888.2 520895576 512669182 498200760 484847183 480732651 478827515 473827438 470042839 469122810
892.1 469122810 461367760 454790764 457417412 462188683 461692314 460296402 460356979 459237556 460271225
896.4 460271225 458591652 461450729 460957794 458157501 456665077 460578766 462611771 459216003 460426369
$$ packed form
868.5G95227356J287079Q71277k946320j3404617l594818N042953N130158K54516j337356
872.8G86530228m694062j1054611q934936K431793N061035l834381j3760986p158280
876.7G44585800q302612o611023L84064r253693o142883j0283966j5826264r602737
880.5F78946686o919632r783173j0000000j5101623j8371468j2440491q038559q862304
884.4E89429436j2493820q342095j865692r850273j2293930n497284p639198j0551568
888.2E20895576q226394j4468422j3353577m114532j905136n000077l784599r20029
892.1D69122810p755050o576996K626648M771271m96369j395912O0577j119423J033669
896.4D60271225j679573K859077m92935k800293j492424L913689K033005l395768J210366
$$ plain form
900.8 460426369 463670731 466942787 469116020 473679810 483441429 489908218 492514610 502137108
904.6 502137108 518191719 524189110 529591293 539747467 549405212 560210304 574364090 587853241
908.5 587853241 598220901 608446999 613993263 621265221 628405342 642328262 658315811 668612976
912.3 668612976 672245331 675304947 677871475 686402588 698862152 711895523 718725739 722457199
916.2 722457199 725609131 728080673 733454132 735556946 734426727 740430984 744277649 748097687
920.1 748097687 754216461 757785797 765667267 768691025 765288315 769591141 772323608 772082138 770553360
924.4 770553360 773293076 781024323 782093735 780866470 780560303 785717697 786549072 785161591 788812027
928.7 788812027 795231705 796156540 794947205 794167328 792739716 796304321 797177429 794226379 798966293
$$ packed form
900.8D60426369L244362L272056K173233M563790R761619O466789K606392R622498
904.6E02137108J6054611N997391N402183J0156174R657745J0805092J4153786J3489151
908.5E87853241J0367660J0226098N546264P271958P140121J3922920J5987549J0297165
912.3F68612976L632355L059616K566528Q531113J2459564J3033371O830216L731460
916.2G22457199L151932K471542N373459K102814j130219O004257L846665L820038
920.1G48097687O118774L569336P881470L023758l402710M302826K732467k41470j528778
924.4G70553360K739716P731247J069412j227265l06167N157394Q31375j387481L650436
928.7G88812027O419678R24835j209335p79877j427612L564605Q73108k951050M739914
$$ plain form
933.1 798966293 799086533 796833496 795740738 795912781 799701920 804022369 799745636 794908981 799628448
937.4 799628448 802966766 801212540 801062012 800420456 803488007 808279953 804620438 801421509 806049347
941.8 806049347 807930527 808829651 809527817 811023102 807646408 805935135 807178955 805636139 809263611
946.1 809263611 815848007 811511765 804315567 804619293 806854858 805957489 805139084 811616669 811097794
950.4 811097794 804153061 806104355 809818344 809274673 803701782 800782700 797015686 795823059 794161835
954.8 794161835 793723526 795871506 794775696 793474350 785516891 775733261 768722000 766561508 769915924
959.1 769915924 766854706 763926163 768586807 768236313 767749481 772872849 778734894 780419083 780546417
963.5 780546417 784253311 789406281 790843353 794431076 800611496 802103424 803889694 804582291 800270920
$$ packed form
933.1G98966293J20240k253037j092758J72043L789139M320449m276733m836655M719467
937.4G99628448L338318j754226j50528o41556L067551M791946l659515l198929M627838
941.8H06049347J881180Q99124O98166J495285l376694j711273J243820j542816L627472
946.1H09263611O584396m336242p196198L03726K235565q97369q18405O477585n18875
950.4H11097794o944733J951294L713989n43671n572891k919082l767014j192627j661224
954.8G94161835m38309K147980j095810j301346p957459r783630p011261k160492L354416
959.1G69915924l061218k928543M660644l50494m86832N123368N862045J684189J27334
963.5G80546417L706894N152970J437072L587723O180420J491928J786270O92597m311371
$$ plain form
967.8 800270920 800592194 805695038 806862793 806130524 806697235 808414688 808612061 813070831 811920319
972.1 811920319 809285812 807952118 805500336 802064514 803086777 809247208 813380356 811046524
976 811046524 807569122 805734711 806693649 806320724 806371384 803942719 798374634 796211395 794283218
980.3 794283218 794858170 795200653 792621689 792622299 793408051 793855743 789661026 786160507 788115768 783885040
985.2 783885040 783832245 788207092 787249222 785040970 781061020 776981125 773140945 770006866 768784637
989.5 768784637 767718506 771423035 775280914 772964401 766532440 764596329 767976913 764256287
993.3 764256287 759958115 758860168 760782547 759528732 759273758 756776581 756432114 756792450 755123291
997.7 755123291 757304764 759212646 754808350 753837357 755410385 758376007 755368652 754786148 758057480
$$ packed form
967.8H00270920L21274N102844J167755p32269N66711J717453J97373M458770j150512
972.1H11920319k634507j333694k451782l435822J022263O160431M133148k333832
976H11046524l477402j834411R58938l72925N0660k428665n568085k163239j928177
980.3G94283218N74952L42483k578964O10P85752M47692m194717l500519J955261m230728
985.2G83885040n2795M374847r57870k208252l979950m079895l840180l134079j222229
989.5G68784637j066131L704529L857879k316513o431961j936111L380584l720626
993.3G64256287m298172j097947J922379j253815k54974k497177l44467L60336j669159
997.7G55123291K181473J907882m404296r70993J573028K965622l007355n82504L271332
$$ plain form
1002 758057480 758249130 756877060 755995560 752758255 753497925 759143753 760072708 757501373 755793152
1006.4 755793152 757024918 759087219 758848495 759011154 760935974 759292984 757966919 757472687 757414703
1010.7 757414703 758020859 758231506 755797653 752700882 753319016 753732758 753659973 750237122 746856689
1015 746856689 744637146 747252274 749423294 747945633 746956635 746730194 747997818 749612656 748452377
1019.4 748452377 746141663 742274475 739364166 734255981 732659378 740697479 742228088 733903503
1023.2 733903503 726571884 722777405 721684799 722760773 722670212 717831726 713060684 714452362 717235641
1027.6 717235641 716849976 714359131 713470078 711745224 713197327 715543213 715215683 713380203 714324722
1031.9 714324722 720109863 719732895 719723816 718219223 718457336 723291550 723470459 718162689 714181976
$$ packed form
1002G58057480J91650j372070q81500l237305P39670N645828R28955k571335j708221
1006.4G55793152J231766K062301k38724J62659J924820j642990j326065m94232n7984
1010.7G57414703O06156K10647k433853l096771O18134M13742p2785l422851l380433
1015G46856689k219543K615128K171020j477661r88998k26441J267624J614838j160279
1019.4G48452377k310714l867188k910309n108185j596603Q038101J530609q324585
1023.2G33903503p331619l794479j092606J075974r0561m838486m771042J391678K783279
1027.6G17235641l85665k490845q89053j724854J452103K345886l27530j835480R44519
1031.9G14324722N785141l76968r079j504593K38113M834214J78909n307770l980713
$$ plain form
1036.3 714181976 713511429 714546432 718170395 718027573 716932373 721875229 725526657 726602402 723506775
1040.6 723506775 718978806 714056702 709106903 707049561 708316803 707140350 703236313 700103531
1044.5 700103531 697866898 693174438 693418655 694461670 687226562 683595734 683315659 685871277 686144562
1048.8 686144562 688383026 694314270 697503586 698498993 697041550 695358353 692597504 692311401 687609482
1053.1 687609482 679357147 674193802 673014908 667847443 656273270 645406113 640449753 639487915
1057 639487915 638076553 636556282 638327522 641363602 644581833 648013458 655623703 660983505 660037689
1061.3 660037689 658587036 662608261 667470474 668069611 666352234 669454269 679264679 684945068
1065.2 684945068 685559235 691863708 699989395 708533401 718341522 719956284 723062820 726374054
$$ packed form
1036.3G14181976o70547J035003L623963j42822j095200M942856L651428J075745l095627
1040.6G23506775m527969m922104m949799k057342J267242j176453l904037l132782
1044.5G00103531k236633m692460K44217J043015p235108l630828k80075K555618K73285
1048.8F86144562K238464N931244L189316R95407j457443j683197k760849k86103m701919
1053.1F87609482q252335n163345j178894n167465j1574173j0867157m956360r61838
1057F39487915j411362j520271J771240L036080L218231L431625P610245N359802r45816
1061.3F60037689j450653M021225M862213N99137j717377L102035R810410N680389
1065.2F84945068O14167O304473Q125687Q544006R808121J614762L106536L311234
$$ plain form
1069.1 726374054 725981140 731241989 736692581 737174377 739900742 747542038 749641495 744792938 743384781
1073.4 743384781 748609085 749980545 751100388 753544083 753002396 754642334 755422897 753770752 756149826
1077.7 756149826 755261536 757121429 762297134 760801544 753588028 751321640 753386459 754560242
1081.6 754560242 752698059 754120102 759691696 761812668 759014511 758357391 759699478 763991699
1085.5 763991699 760806961 755491714 752893372 749456406 746064758 744087677 743557053 741679916
1089.3 741679916 738176346 737919846 739281845 736216431 733502197 733101730 731331711 726696625 719044266
1093.6 719044266 717093658 718872833 715822449 710713043 702819443 697356567 693460388 690558548
1097.5 690558548 685833435 678768692 670837708 665478287 657264938 649861374 644824600 639635010
$$ packed form
1069.1G26374054l92914N260849N450592M81796K726365P641296K099457m848557j408157
1073.4G43384781N224304J371460J119843K443695n41687J639938P80563j652145K379074
1077.7G56149826q88290J859893N175705j495590p213516k266388K064819J173783
1081.6G54560242j862183J422043N571594K120972k798157o57120J342087M292221
1085.5G63991699l184738n315247k598342l436966l391648j977081n30624j877137
1089.3G41679916l503570k56500J361999l065414k714234m00467j770019m635086p652359
1093.6G19044266j950608J779175l050384n109406p893600n462876l896179k901840
1097.5F90558548m725113p064743p930984n359421q213349p403564n036774n189590
$$ plain form
1101.4 639635010 633849907 623541718 615292816 606189919 597282104 590547180 585375366 581239243
1105.2 581239243 574406662 565219193 555834503 551619453 542004433 531534538 525149879 519663467
1109.1 519663467 513657455 508332939 504895325 502586098 504144821 508527298 516813087 527159538
1112.9 527159538 538125114 548431129 558913345 571475372 584633827 593946457 603073425 610890465
1116.8 610890465 619772148 629377937 636078720 643776550 650565796 659412231 669375916 677573166
1120.7 677573166 686260834 694226990 698387222 705006638 710232468 712884216 715952148 720189438
1124.5 720189438 725951462 729658661 734104996 740439911 741469040 741988373 744098129 743778915 743685760
1128.8 743685760 747736053 749046783 749009399 749216537 748874283 751030731 752970047 754402771 753732605
$$ packed form
1101.4F39635010n785103j0308189q248902r102897q907815o734924n171814m136123
1105.2E81239243o832581r187469r384690m215050r615020j0469895o384659n486412
1109.1E19663467o006012n324516l437614k309227J558723M382477Q285789J0346451
1112.9E27159538J0965576J0306015J0482216J2562027J3158455R312630R126968P817040
1116.8F10890465Q881683R605789O700783P697830O789246Q846435R963685Q197250
1120.7F77573166Q687668P966156M160232O619416N225830K651748L067932M237290
1124.5G20189438N762024L707199M446335O334915J029129N19333K109756l19214r3155
1128.8G43685760M050293J310730l7384K07138l42254K156448J939316J432724o70166
$$ plain form
1133.2 753732605 752824936 751908340 749861908 746363907 742478104 740369415 739902115 737114182 732753525
1137.5 732753525 730057602 724901047 718618164 714179993 710378952 704939041 700319214 694995575
1141.4 694995575 693006592 692552795 688315506 685782547 691176147 697565155 701487045 706667709
1145.2 706667709 711501846 715172577 720750809 728171539 735601120 736195221 735480194 737342987 739104385
1149.6 739104385 741356735 744821396 747887192 749450607 748100357 747911758 750765610 750894775 749928513
1153.9 749928513 753110580 756207199 757246323 760110397 762869568 765016327 767299500 768268890
1157.8 768268890 768969193 769071579 769642334 771090622 774900894 778280869 775743103 774113541 774347687
1162.1 774347687 776066132 776990662 778276291 781669846 781775818 781327133 781073990 777835007 777111588
$$ packed form
1133.2G53732605r07669r16596k046432l498001l885803k108689m67300k787933m360657
1137.5G32753525k695923n156555o282883m438171l801041n439911m619827n323639
1141.4F94995575j988983m53797m237289k532959N393600O389008L921890N180664
1145.2G06667709M834137L670731N578232P420730P429581N94101p15027J862793J761398
1149.6G39104385K252350L464661L065796J563415j350250j88599K853852J29165r66262
1153.9G49928513L182067L096619J039124K864074K759171K146759K283173R69390
1157.8G68268890P00303J02386N70755J448288L810272L379975k537766j629562K34146
1162.1G74347687J718445R24530J285629L393555J05972m48685k53143l238983p23419
$$ plain form
1166.5 777111588 781413803 783551254 784507980 784585495 786358871 786245575 786790314 788789444 788733749
1170.8 788733749 787224045 788021927 787968674 789293365 794068909 794218826 790010910 788147202 790108414
1175.1 790108414 790308990 789603729 789887543 788324432 786266937 786125031 787046661 789312286 793552246
1179.5 793552246 792752151 790906067 790534744 792683029 792657013 790785370 791389465 793777008 792677078
1183.8 792677078 792202682 791346359 791666489 791677246 790836411 791150284 792262955 792733536 791887665 790851898
1188.6 790851898 793311234 795120697 793099976 791138229 788843155 790261688 791896591 791040039
1192.5 791040039 791743164 792053833 790525742 791396255 791699066 789607468 788929214 790217438 791002579
1196.8 791002579 790448380 789318161 787230148 783658218 783163071 785068588 784646378 781782227 779008865
$$ packed form
1166.5G77111588M302215K137451R56726P7515J773376j13296N44739J999130n5695
1170.8G88733749j509704P97882n3253J324691M775544J49917m207916j863708J961212
1175.1G90108414K00576p05261K83814j563111k057495j41906R21630K265625M239960
1179.5G93552246q00095j846084l71323K148285k6016j871643O04095K387543j099930
1183.8G92677078m74396q56323L20130J0757q40835L13873J112671M70581q45871j035767
1188.6G90851898K459336J809463k020721j961747k295074J418533J634903q56552
1192.5G91040039P03125L10669j528091Q70513L02811k091598o78254J288224P85141
1196.8G91002579n54199j130219k088013l571930m95147J905517m22210k864151k773362
$$ plain form
1201.2 779008865 778395081 776087494 771965256 768933640 769175949 769268646 768762360 767113419 765049210
1205.5 765049210 764379501 763810959 763289566 765127335 764884949 763895416 763768082 764678268 765224915
1209.9 765224915 767358856 771274338 771231918 769825668 769310989 769733963 770576935 771936340 773933182
1214.2 773933182 775799179 774424667 774047623 773127289 773114243 775615234 774861526 773971481 775578766
1218.5 775578766 777203674 776674576 776156845 776685257 776711884 775002136 774444122 775210571 775915756
1222.9 775915756 775357361 772227554 773194351 775320587 775847549 774631577 773248138 769801102 765882645
1227.2 765882645 765661774 763841476 763024139 763352203 762255249 758895645 758142242 757078400 754797440
1231.6 754797440 747610245 741812744 741654053 739891510 733591461 726769791 719999008 714344711
$$ packed form
1201.2G79008865o13784k307587m122238l031616K42309R2697n06286j648941k064209
1205.5G65049210o69709n68542n21393J837769k42386r89533j27334R10186N46647
1209.9G65224915K133941L915482m2420j406250n14679M22974Q42972J359405J996842
1214.2G73933182J865997j374512l77044r20334j3046K500991p53708q90045J607285
1218.5G75578766J624908n29098n17731N28412K6627j709748n58014P66449P05185
1222.9G75915756n58395l129807R66797K126236N26962j215972j383439l447036l918457
1227.2G65882645k20871j820298q17337L28064j096954l359604p53403j063842k280960
1231.6G54797440p187195n797501j58691j762543o300049o821670o770783n654297
$$ plain form
1235.4 714344711 711666260 709955673 706954422 704966965 704151917 699748535 696395721 694495850
1239.3 694495850 691129761 687227097 684871750 681958618 676260071 669871368 662613449 653894501
1243.1 653894501 646030960 639655838 630283775 624111443 619606094 614996452 613084373 611935768
1247 611935768 611474724 615074615 621324501 622972984 625072021 633671875 641137085 648672943 657750549
1251.3 657750549 661347809 665606384 672069550 678176193 679956055 683216782 689387283 691780167
1255.2 691780167 692580414 697789917 704441757 708455200 709741058 712920074 717073441 718994217
1259 718994217 720714417 722506485 726506500 727288971 727533035 728259735 726747284 725216827 724934158
1263.4 724934158 722764435 719909744 720658493 723009109 721370010 715962677 714226913 716581039
$$ packed form
1235.4G14344711k678451j710587l001251j987457q15048m403382l352814j899871
1239.3F94495850l366089l902664k355347k913132n698547o388703p257919q718948
1243.1F53894501p863541o375122r372063o172332m505349m609642j912079j148605
1247F11935768m61044L599891O249886J648483K099037Q599854P465210P535858R077606
1251.3F57750549L597260M258575O463166O106643J779862L260727O170501K392884
1255.2F91780167Q00247N209503O651840M013443J285858L179016M153367J920776
1259G18994217J720200J792068M000015P82471K44064P26700j512451j530457k82669
1263.4G24934158k169723k854691P48749K350616j639099n407333j735764K354126
$$ plain form
1267.2 716581039 720263519 723951035 723564606 724540863 728500061 732462311 734484711 737905579 741479416
1271.6 741479416 743147583 747502213 751316299 754713669 756398926 758128357 761145096 761244125 761077499
1275.9 761077499 763747787 767689209 768083344 766958008 765882111 766294250 769174576 771770248 772193527
1280.3 772193527 771566772 770006714 769600372 769054108 765775986 762361984 762734833 762738953 760245743
1284.6 760245743 761211929 760158997 759508057 760694199 760678253 758094406 757353668 759596634 758938751
1288.9 758938751 757090149 757941284 758344955 759641724 759820480 758772888 759639511 763100739 762265244
1293.3 762265244 759870071 759063339 757013016 753718948 754541779 756614227 755843201 754049759 753162079
1297.6 753162079 754003677 752711563 753227463 755102692 753564987 753151398 756224747 755991364 755374146
$$ packed form
1267.2G16581039L682480L687516l86429R76257L959198L962250K022400L420868L573837
1271.6G41479416J668167M354630L814086L397370J685257J729431L016739R9029j66626
1275.9G61077499K670288L941422L94135j125336j075897M12139K880326K595672M23279
1280.3G72193527o26755j560058m06342n46264l278122l414002L72849M120k493210
1284.6G60245743R66186j052932o50940J186142j5946k583847p40738K242966o57883
1288.9G58938751j848602Q51135M03671J296769J78756j047592Q66623L461228q35495
1293.3G62265244k395173q06732k050323l294068Q22831K072448p71026j793442q87680
1297.6G53162079Q41598j292114N15900J875229j537705m13589L073349k33383o17218
$$ plain form
1302 755374146 755130081 755786896 756241989 756381989 756235428 754301834 753919601 756024170 758542862
1306.3 758542862 759492493 758261642 759207535 760936203 761208344 761788940 764784927 764261169 762502518
1310.6 762502518 761832962 763575287 766074677 764986496 762199936 760910721 759637985 760951080
1314.5 760951080 761716461 760546951 759871445 759316635 760042114 761002808 759213028 758583832 756607437
1318.8 756607437 753756866 751741028 750428619 750833359 749796448 748250580 745961075 740751953
1322.7 740751953 736777115 735631485 733685760 731750031 728420029 723431396 717755280 713972855
1326.6 713972855 713664093 713919678 712108536 711569977 713107986 714708099 717523499 719841537 721110916
1330.9 721110916 724214401 726420517 727547836 729477158 731893082 732881241 733757858 733357773 733013000
$$ packed form
1302G55374146k44065O56815M55093J40000j46561j933594l82233K104569K518692
1306.3G58542862R49631j230851R45893J728668K72141N80596K995987n23758j758651
1310.6G62502518o69556J742325K499390j088181k786560j289215j272736J313095
1314.5G60951080P65381j169510o75506n54810P25479R60694j789780o29196j976395
1318.8G56607437k850571k015838j312409M04740j036911j545868k289505n209122
1322.7G40751953l974838j145630j945725j935729l330002m988633n676116l782425
1326.6G13972855l08762K55585j811142n38559J538009J600113K815400K318038J269379
1330.9G21110916L103485K206116J127319J929322K415924R88159Q76617m00085l44773
$$ plain form
1335.2 733013000 734922028 733621902 730468521 731413498 732078857 730717697 729507141 727015533 724241257
1339.6 724241257 723830185 724302063 722119293 720186234 717272034 713530884 711757584 709853668 708010864
1343.9 708010864 704262924 701648941 700970535 696710587 691580963 687116089 683049850 680452271
1347.8 680452271 678241730 672119293 667691956 666194534 664028473 662293777 656532288 652360001
1351.6 652360001 650470428 647580338 641418839 633491364 627736053 624672737 618436813 609820595
1355.5 609820595 602003288 595235786 589218178 580698051 570718689 564276085 558231430 550152588
1359.3 550152588 542662964 535546112 526607971 515792351 509103127 503359604 496713524 488642197
1363.2 488642197 480345955 475435486 469687996 464632111 462435188 461325798 460356598 458680954
$$ packed form
1335.2G33013000J909028j300126l153381R44977O65359j361160j210556k491608k774276
1339.6G24241257m11072M71878k182770j933059k914200l741150j773300j903916j842804
1343.9G08010864l747940k613983o78406m259948n129624m464874m066239k597579
1347.8F80452271k210541o122437m427337j497422k166061j734696n761489m172287
1351.6F52360001j889573k890090o161499p927475n755311l063316o235924q616218
1355.5F09820595p817307o767502o017608q520127r979362o442604o044655q078842
1359.3E50152588p489624p116852q938141j0815620o689224n743523o646080q071327
1363.2D88642197q296242m910469n747490n055885k196923j109390r69200j675644
$$ plain form
1367.1 458680954 459250946 462014236 464318237 462994194 464731445 470192909 473232231 476557617
1370.9 476557617 478692169 481722755 487916145 493263779 498538170 502463684 504783287 508313179
1374.8 508313179 508478928 510120125 513870888 515167885 514861755 515689697 519460526 521219902 520587082
1379.1 520587082 522344055 525715218 527982368 529418259 530787621 531779175 534893799 539949608
1383 539949608 545196419 548707581 552562904 561759186 569170761 573092384 578761139 585030441 593336601
1387.3 593336601 601227951 607697372 613898277 621061554 627457504 631632881 638866196 645929337
1391.2 645929337 650081863 654618378 660466461 664205093 670449295 677461090 679469223 678480301
1395 678480301 683297424 686351089 686383362 687954712 691567307 692947006 693259048 695112610 696381226
$$ packed form
1367.1D58680954N69992K763290K304001j324043J737251N461464L039322L325386
1370.9D76557617K134552L030586O193390N347634N274391L925514K319603L529892
1374.8E08313179J65749J641197L750763J296997l06130Q27942L770829J759376o32820
1379.1E20587082J756973L371163K267150J435891J369362R91554L114624N055809
1383E39949608N246811L511162L855323R196282P411575L921623N668755O269302Q306160
1387.3E93336601P891350O469421O200905P163277O395950M175377P233315P063141
1391.2F45929337M152526M536515N848083L738632O244202P011795K008133r88922
1395F78480301M817123L053665L2273J571350L612595J379699L12042J853562J268616
$$ plain form
1399.4 696381226 695249176 695527115 695070114 696424255 698721848 700450211 698924103 696157532 697610397
1403.7 697610397 699364319 697285309 694375229 692086105 694043503 694735870 694497681 694416504 692004776
1408 692004776 688806152 687045364 684603958 683003159 681367798 679073639 675852814 670786819 666952972
1412.4 666952972 662689209 659930267 655363464 650274277 647401962 644912872 644009552 641308899
1416.2 641308899 638396225 638741989 640707321 640404587 639214363 640150452 645161591 644211655 645132217
1420.6 645132217 645619812 645055923 643112183 641048660 639534073 639019165 634159775 628203964 623457642
1424.9 623457642 616931458 608469543 599493141 591418877 585968132 576851578 565520554 555439377
1428.8 555439377 544197769 533086510 520313835 511424141 501140175 491766281 485399971 481539421
$$ packed form
1399.4F96381226j132050K77939m57001J354141K297593J728363j526108k766571J452865
1403.7F97610397J753922k079010k910080k289124J957398O92367k38189q1177k411728
1408F92004776l198624j760788k441406j600799j635361k294159l220825n065995l833847
1412.4F66952972m263763k758942m566803n089187k872315k489090r03320k700653
1416.2F41308899k912674L45764J965332l02734j190224R36089N011139r49936R20562
1420.6F45132217M87595n63889j943740k063523j514587n14908m859390n955811m746322
1424.9F23457642o526184q461915q976402q074264n450745r116554j1331024j0081177
1428.8E55439377j1241608j1111259j2772675q889694j0283966r373894o366310l860550
$$ plain form
1432.6 481539421 477761383 473970757 471154366 470572433 472397041 476319733 483664322 494578743
1436.5 494578743 494936485 490563812 493703651 501727715 508799667 510782967 513273582 518133965
1440.4 518133965 521019402 522957535 527211647 529211845 531685715 533966141 532009201 529771156
1444.2 529771156 529556236 529813919 527832603 525042458 522941093 519087029 515095711 509454079 503922806
1448.6 503922806 503354301 500117378 496686707 495464478 496969109 500469322 506924782 513800354
1452.4 513800354 519758148 525763130 535279655 544495773 552407684 562354088 573083229 581792068
1456.3 581792068 595321503 602613792 607988014 615383148 619968262 624849548 631153641 637227058
1460.1 637227058 643970337 650120392 655313492 661186066 668831482 674743958 677231369 681597290
$$ packed form
1432.6D81539421l778038l790626k816391n81933J824608L922692P344589J0914421
1436.5D94578743L57742m372673L139839Q024064P071952J983300K490615M860383
1440.4E18133965K885437J938133M254112K000198K473870K280426j956940k238045
1444.2E29771156k14920K57683j981316k790145k101365l854064l991318n641632n531273
1448.6E03922806n68505l236923l430671j222229J504631L500213O455460O875572
1452.4E13800354N957794O004982R516525R216118P911911R946404J0729141Q708839
1456.3E81792068J3529435P292289N374222P395134M585114M881286O304093O073417
1460.1F37227058O743279O150055N193100N872574P645416N912476K487411M365921
$$ plain form
1464 681597290 687474823 696510468 699799500 699383698 703484497 706730957 709105301 711178970 712764740
1468.3 712764740 716602707 719765015 723089981 727976379 730421982 729744492 736893158 745955048
1472.2 745955048 743413391 739845657 741878738 746178741 746956711 746689529 746424103 749411926 752707367
1476.5 752707367 751126328 751608124 753542328 755329666 755159302 755634460 757798233 761163330 762677231
1480.9 762677231 762757492 763177795 763818054 764281235 764671249 765611877 764575653 764394379 764850082 766389084
1485.7 766389084 767315445 769457092 771064758 773455582 773919907 772306747 773091660 776587143 776885147
1490 776885147 777660522 775781860 773297653 772824860 773536911 774396210 774756393 774107513 775267029
1494.4 775267029 776860275 776076813 773981018 773545227 777387924 776271744 776310806 777932053 778241043
$$ packed form
1464F81597290N877533R035645L289032m15802M100799L246460K374344K073669J585770
1468.3G12764740L837967L162308L324966M886398K445603o77490P148666R061890
1472.2G45955048k541657l567734K033081M300003P77970k67182k65426K987823L295441
1476.5G52707367j581039M81796J934204J787338j70364M75158K163773L365097J513901
1480.9G62677231Q0261M20303O40259M63181L90014R40628j036224j81274M55703J539002
1485.7G66389084R26361K141647J607666K390824M64325j613160P84913L495483K98004
1490G76885147P75375j878662k484207m72793P12051Q59299L60183o48880J159516
1494.4G75267029J593246p83462k095795m35791L842697j116180L9062J621247L08990
$$ plain form
1498.7 778241043 779365921 778363495 777796249 778546371 780395050 779922028 779548264 780067673 779833298
1503 779833298 777672577 776441345 778129272 781188736 782522049 786928787 787213211 792086639 805086899
1507.4 805086899 794487610 784038162 780505753 784914017 784192505 781671066 781168518 779325485
1511.2 779325485 777796783 779417343 784761810 784407349 779751434 776789856 778356705 782613754
1515.1 782613754 782514725 779334946 781920090 784944458 781423645 784091263 784683075 782617798 782733688
1519.4 782733688 783770218 783759155 787561569 785168762 787714996 785863571 786478806 788424530 784176331
1523.8 784176331 781685104 784894943 784411774 782685776 784506760 783097382 782390442 780710602 779824677
1528.1 779824677 781927414 786021729 785219955 782168350 781459961 780708466 780980606 780143814 777737274
$$ packed form
1498.7G78241043J124878j002426n67246P50122J848679m73022l73764N19409k34375
1503G79833298k160721j231232J687927L059464J333313M406738K84424M873428J3000260
1507.4H05086899j0599289j0449448l532409M408264p21512k521439n02548j843033
1511.2G79325485j528702J620560N344467l54461m655915k961578J566849M257049
1515.1G82613754r9029l179779K585144L024368l520813K667618N91812k065277J15890
1519.4G82733688J036530j1063L802414k392807K546234j851425O15235J945724m248199
1523.8G84176331k491227L209839m83169j725998J820984j409378p06940j679840q85925
1528.1G79824677K102737M094315q01774l051605p08389p51495K72140q36792k406540
$$ plain form
1532.5 777737274 779232635 782971191 787892914 785027084 780726852 779184265 778156128 776336441
1536.3 776336441 776709824 778732834 780598679 784272308 789361572 802093277 798259735 786397781
1540.2 786397781 784585876 784606247 779670181 781309128 786633682 783910980 781907730 778002548 773905029
1544.5 773905029 772852325 779075546 778994598 775641479 776560287 778668060 778115616 773287125 773850784
1548.9 773850784 775526276 776029816 774794312 775577469 774548874 774523315 776103287 776994324 775785294
1553.2 775785294 775490646 774079361 774922333 774485321 773508682 774145889 778502884 780617828 776935654
1557.5 776935654 780845184 781875534 782834778 780623550 778896408 780182571 778520050 775424652
1561.4 775424652 772997437 771801071 773350677 772383881 771432800 775432434 778013535 776419449 775446777
$$ packed form
1532.5G77737274J495361L738556M921723k865830m300232j542587j028137j819687
1536.3G76336441L73383K023010J865845L673629N089264J2731705l833542j1861954
1540.2G86397781j811905K0371m936066J638947N324554k722702k003250l905182m097519
1544.5G73905029j052704O223221q0948l353119R18808K107773n52444m828491N63659
1548.9G73850784J675492N03540j235504P83157j028595k5559J579972Q91037j209030
1553.2G75785294k94648j411285Q42972m37012r76639O37207M356995K114944l682174
1557.5G76935654L909530J030350R59244k211228j727142J286163j662521l095398
1561.4G75424652k427215j196366J549606r66796r51081L999634K581101j594086r72672
$$ plain form
1565.7 775446777 773693390 770820694 772073212 773834305 774027176 771535568 771997528 775761414 779256287
1570.1 779256287 777029037 774921265 774059067 773450012 773420105 773346481 772284088 771787872 771388016
1574.4 771388016 772084503 773135452 771717377 773068619 777961502 774805298 770084229 769273987 769820023
1578.7 769820023 771211548 770335464 769526825 770465164 769743500 768614120 769674683 770581741 769515305
1583.1 769515305 767888718 768305206 768594742 766821213 766654587 767043076 765386658 766657867 768965530
1587.4 768965530 767514572 765288544 767884827 770315704 766990356 763985901 767027435 768783798
1591.3 768783798 767641373 766152725 763672943 763153381 763498917 763319931 764835815 765925827 763749237
1595.6 763749237 764470596 763757095 761423264 762398987 764555969 763892517 760405426 759265747 760246887
$$ packed form
1565.7G75446777j753387k872696J252518J761093J92871k491608M61960L763886L494873
1570.1G79256287k227250k107772q62198o09055k9907p3624j062393m96216l99856
1574.4G71388016O96487J050949j418075J351242M892883l156204m721069q10242N46036
1578.7G69820023J391525q76084q08639R38339p21664j129380J060563R07058j066436
1583.1G69515305j626587M16488K89536j773529j66626L88489j656418J271209K307663
1587.4G68965530j450958k226028K596283K430877l325348l004455L041534J756363
1591.3G68783798j142425j488648k479782n19562L45536j78986J515884J090012k176590
1595.6G63749237P21359p13501k333831R75723K156982o63452l487091j139679R81140
$$ plain form
1600 760246887 761904373 761555786 762248077 763596954 763302689 762352982 760926819 760132675 758306732
1604.3 758306732 756969070 757598038 758405685 756728439 755387039 754220505 754075699 754902496 755494003
1608.6 755494003 754977036 753315582 751338730 752108383 752358704 751193695 750253754 748747864 747487717
1613 747487717 744817886 744610367 746059341 743490295 742061234 740598984 739373627 738945312 743335114
1617.3 743335114 740114441 739345932 738390579 737602768 736058502 735050888 735843964 734499588 732632523
1621.7 732632523 732144852 731949997 732733002 728426208 725087280 722483139 721855927 719914551 716621170
1626 716621170 714264221 711463776 707268906 706230774 705093918 700580902 695067520 691747513 687509766
1630.3 687509766 683403015 678155212 674193649 670752029 667600632 663878555 657369308 650090103
$$ packed form
1600G60246887J657486l48587O92291J348877k94265r49707j426163p94144j825943
1604.3G58306732j337662O28968Q07647j677246j341400j166534j44806Q26797N91507
1608.6G55494003n16967j661454j976852P69653K50321j165009r39941j505890j260147
1613G47487717k669831k07519J448974k569046j429061j462250j225357m28315M389802
1617.3G43335114l220673p68509r55353p87811j544266j007614P93076j344376j867065
1621.7G32632523m87671j94855P83005m306794l338928k604141o27212j941376l293381
1626G16621170k356949k800445m194870j038132j136856m513016n513382l320007m237747
1630.3F87509766m106751n247803l961563l441620l151397l722077o509247p279205
$$ plain form
1634.2 650090103 646874313 638575363 625492401 616136703 610294876 603233452 591431694 578332901
1638.1 578332901 570216713 558759651 547231216 537699394 529082031 521476212 512396126 505899200
1641.9 505899200 502312469 497935066 494956894 491272964 487391090 487172203 490467911 494889450
1645.8 494889450 489729424 494006424 503346252 507152634 511341667 515438614 522584267 527699585
1649.6 527699585 533348389 539470177 545552902 548925514 552467575 557760811 559491653 548215408
1653.5 548215408 549408684 545250359 528710785 518741875 512248878 500776482 487496338 475233459
1657.3 475233459 463037186 448834877 433676071 416190338 401003189 384084282 365913353
1660.7 365913353 348035851 328492012 313256989 294930878 258893204 240828667 228151722
$$ packed form
1634.2F50090103l215790q298950j3082962r355698n841827p061424j1801758j3098793
1638.1E78332901q116188j1457062j1528435r531822q617363p605819r080086o496926
1641.9E05899200l586731m377403k978172l683930l881874k18887L295708M421539
1645.8D94889450n160026M277000R339828L806382M189033M096947P145653N115318
1649.6E27699585N648804O121788O082725L372612L542061N293236J730842j1276245
1653.5E48215408J193276m158325j6539574r968910o492997j1472396j3280144j2262879
1657.3D75233459j2196273j4202309j5158806j7485733j5187149j6918907j8170929
1660.7C65913353j7877502j9543839j5235023j8326111l6037674j8064537j2676945
$$ plain form
1664.1 228151722 213705292 199169579 185182858 171309643 159235535 148630962 140517511
1667.5 140517511 134053717 126425142 122033062 114619989 99319868 96427784 96145096 95076284
1671.3 95076284 86188908 80526981 78748808 77921958 76191769 75084701 76076179 81385374 74728270
1675.7 74728270 70651302 71039791 74007421 76295261 76742549 78641620 84307098 89802246 94546766
1680 94546766 98419743 101969833 107933216 114365625 122965269 135354242 150737152 164123726
1683.9 164123726 179264145 196577911 208111057 223689175 242794075 263882561 286877842
1687.2 286877842 310048656 335608063 359089622 381232452 403535500 426745033 446785545
1690.6 446785545 465228806 483696213 503081703 520449371 536283875 550455132 564484711
$$ packed form
1664.1B28151722j4446430j4535713j3986721j3873215j2074108j0604573q113451
1667.5A40517511o463794p628575m392080p413073j5300121k892084k82688j068812
1671.3I5076284q887376n661927j778173q26850j730189j107068R91478N309195o657104
1675.7G4728270m076968L88489K967630K287840M47288J899071N665478N495148M744520
1680I4546766L872977L550090N963383O432409Q599644J2388973J5382910J3386574
1683.9A64123726J5140419J7313766J1533146J5578118J9104900K1088486K2995281
1687.2B86877842K3170814K5559407K3481559K2142830K2303048K3209533K0040512
1690.6D46785545J8443261J8467407J9385490J7367668J5834504J4171257J4029579
$$ plain form
1694 564484711 577469826 590259056 604371948 623792381 626797943 629451866 636020126 644362411
1697.9 644362411 649306717 656482773 664473190 670960236 665542679 672038345 681419144 683830414
1701.7 683830414 681989822 683394547 687010803 692354126 694132996 696953659 698759918 699891434
1705.6 699891434 702408371 706273727 707223206 708395767 709702759 709147797 708523102 711665955 714824066
1709.9 714824066 714725952 715622864 717939911 720300369 721102142 720187378 722739334 727040939 728086548
1714.2 728086548 726886902 730068512 733718414 734339294 735322418 734477997 734445038 742216263 742692032
1718.6 742692032 743556976 741347275 739704437 738565598 739046860 737551727 738569946 742327118 743289566
1722.9 743289566 743046417 742654495 740427170 740108414 742947159 743751678 742141113 744599304 746160355
$$ packed form
1694E64484711J2985115J2789230J4112892J9420433L005562K653923O568260Q342285
1697.9F44362411M944306P176056P990417O487046n417557O495666R380799K411270
1701.7F83830414j840592J404725L616256N343323J778870K820663J806259J131516
1705.6F99891434K516937L865356R49479J172561J306992n54962o24695L142853L158111
1709.9G14824066r8114Q96912K317047K360458Q01773r14764K551956M301605J045609
1714.2G28086548j199646L181610L649902O20880R83124q44421l2959P771225M75769
1718.6G42692032Q64944k209701j642838j138839M81262j495133J018219L757172R62448
1722.9G43289566k43149l91922k227325l18756K838745Q04519j610565K458191J561051
$$ plain form
1727.3 746160355 746867523 745497284 745984268 747243118 747627945 751424637 752375793 750253830 748560104
1731.6 748560104 747898254 749309769 751816940 754188843 755753326 748178177 753170319 756996765
1735.5 756996765 754557343 752785263 752959747 754714584 754489365 755391312 755470200 756964340 759989624
1739.8 759989624 761372299 758172989 757691650 758811874 760063629 761751480 762358093 765103683 765683289
1744.1 765683289 765979614 765877838 766504440 766350784 768912582 772034912 772262726 773963165 775223160
1748.5 775223160 773609314 773380661 772390366 772062607 775724487 779563751 775901947 774046783 775210495
1752.8 775210495 776942368 777288361 777016296 776728897 774977722 772841187 772888870 774113388 776652222
1757.2 776652222 776445999 776463394 776730347 776249008 774689407 775389023 777308426 777749557 775350647
$$ packed form
1727.3G46160355P07168j370239M86984J258850L84827L796692R51156k121963j693726
1731.6G48560104o61850J411515K507171K371903J564483p575149M992142L826446
1735.5G56996765k439422j772080J74484J754837k25219R01947P8888J494140L025284
1739.8G59989624J382675l199310m81339J120224J251755J687851O06613K745590N79606
1744.1G65683289K96325j01776O26602j53656K561798L122330K27814J700439J259995
1748.5G75223160j613846k28653r90295l27759L661880L839264l661804j855164J163712
1752.8G75210495J731873L45993k72065k87399j751175k136535M7683J224518K538834
1757.2G76652222k06223J7395K66953m81339j559601O99616J919403M41131k398910
$$ plain form
1761.5 775350647 777819443 781901855 779273682 778385773 777548218 776422882 776429214 776461029 776867752
1765.8 776867752 777091064 775355301 775093307 777276993 779589005 781766891 781161194 780401230 779300995
1770.2 779300995 779761505 776427689 776492233 780655365 780548172 783479614 781664505 776628952 773878632
1774.5 773878632 773395996 776231384 778600464 778585281 777399902 774101486 773024521 774648972 775266418
1778.9 775266418 774983139 775048294 775368576 776722946 778041687 775967484 773220673 772679520 774883575
1783.2 774883575 774054337 774264679 774188538 774304886 775560837 775098648 773125229 773416595 773861465
1787.5 773861465 772154160 771339493 771381226 772151718 773337021 775243454 777675629 776610260 774702530
1791.9 774702530 773889694 770995483 771603165 771139374 772366333 772637482 771618042 771535797 772546387
$$ packed form
1761.5G75350647K468796M082412k628173q87909q37555j125336O332L1815M06723
1765.8G76867752K23312j735763k61994K183686K312012K177886o05697p59964j100235
1770.2G79300995M60510l333816O4544M163132j07193K931442j815109n035553k750320
1774.5G73878632m82636K835388K369080j5183j185379l298416j076965J624451O17446
1778.9G75266418k83279O5155L20282J354370J318741k074203k746811n41153K204055
1783.2G74883575q29238K10342p6141J16348J255951m62189j973419K91366M44870
1787.5G73861465j707305q14667M1733P70492J185303J906433K432175j065369j907730
1791.9G74702530q12836k894211O07682m63791J226959K71149j019440q2245J010590
$$ plain form
1796.2 772546387 774108887 775630112 774124603 772719345 771238480 771356354 775569611 776982727
1800.1 776982727 774548798 776462173 776981049 774612122 772775345 774907227 775333176 774579544 776300735
1804.4 776300735 776639481 775863037 775739975 774367676 772880707 772819595 774717636 777275238 776740417
1808.8 776740417 775002670 776492538 778437653 778443604 777849655 777612305 777152786 778181610 776354218
1813.1 776354218 774900360 777556152 779450073 779111633 778846283 778908386 778352890 780501328 783822098
1817.4 783822098 782332077 780390549 781511459 782936172 782037964 779178772 779276581 781851578 783433838
1821.8 783433838 784524612 786290207 787633133 784702301 782235413 783444366 784611969 785887756
1825.6 785887756 785655441 783925400 782982407 784746323 786624908 785512848 784332886 784780579 784238434
$$ packed form
1796.2G72546387J562500J521225j505509j405258j480865J17874M213257J413116
1800.1G76982727k433929J913375N18876k368927j836777K131882M25949p53632J721191
1804.4G76300735L38746p76444j23062j372299j486969o1112J898041K557602n34821
1808.8G76740417j737747J489868J945115N951n93949k37350m59519J028824j827392
1813.1G76354218j453858K655792J893921l38440k65350O2103n55496K148438L320770
1817.4G83822098j490021j941528J120910J424713q98208k859192R7809K574997J582260
1821.8G83433838J090774J765595J342926k930832k466888J208953J167603J275787
1825.6G85887756k32315j730041r42993J763916J878585j112060j179962M47693n42145
$$ plain form
1830 784238434 788446503 788428574 786493149 786217804 785963898 787408295 787327576 787716446 788181000 789401855
1834.8 789401855 787951126 786439896 786915283 788241577 788020935 788676910 787967758 787783737 785969772
1839.1 785969772 786076431 788311462 787911987 788650208 789067535 788506317 787772675 786005249 785844803
1843.5 785844803 786593323 789216080 789646225 787756119 788032074 788848343 786988297 785477295 788511124
1847.8 788511124 790265808 787045135 787392578 789001999 789244995 789434204 787525406 787433472 788104172
1852.2 788104172 787805023 787223434 787835388 788469543 788439713 787237091 787358856 789953308 790335693
1856.5 790335693 790132523 790565643 789496384 789562073 789699631 790013733 790332413 791006775 791544952 789909286
1861.3 789909286 788776093 788800964 789144821 789154739 789393234 791602020 790456772 789662552 790413513 792349243
$$ packed form
1830G84238434M208069j7929j935425k75345k53906J444397q0719L88870M64554J220855
1834.8G89401855j450729j511230M75387J326294k20642O55975p09152j84021j813965
1839.1G85969772J06659K235031l99475P38221M17327n61218p33642j767426j60446
1843.5G85844803P48520K622757M30145j890106K75955Q16269j860046j511002L033829
1847.8G88511124J754684l220673L47443J609421K42996J89209j908798r1934O70700
1852.2G88104172k99149n81589O11954O34155k9830j202622J21765K594452L82385
1856.5G90335693k03170M33120j069259O5689J37558L14102L18680O74362N38177j635666
1861.3G89909286j133193K4871L43857R918K38495K208786j145248p94220P50961J935730
$$ plain form
1866.1 792349243 795292816 792601624 792025909 792670898 791485825 792859879 795464859 795945969 793176346
1870.5 793176346 791992493 793352890 792643280 790491867 792278976 793680344 791353836 789397125
1874.3 789397125 791236038 791415329 790291519 790857544 792326279 791688385 789849243 790895233 792670441
1878.7 792670441 791733322 789599228 790484543 791833496 790685272 790661926 790586243 791917114 791557388
1883 791557388 791636658 790781097 788197021 789279175 789735794 789764862 790415192 791625214 792212372 790154419
1887.8 790154419 788025284 787488861 789571304 792666321 792962189 792999039 793361816 791367569 791092758
1892.2 791092758 791273193 791960068 792329178 792645111 790850525 789904633 791115646 791032410 792333603
1896.5 792333603 793050079 790535049 789013748 791905060 794189682 792496338 789731216 789261475 789059677
$$ packed form
1866.1G92349243K943573k691192n75715O44989j185073J374054K604980M81110k769623
1870.5G93176346j183853J360397p09610k151413J787109J401368k326508j956711
1874.3G89397125J838913J79291j123810N66025J468735o37894j839142J045990J775208
1878.7G92670441r37119k134094Q85315J348953j148224k3346p5683J330871l59726
1883G91557388P9270q55561k584076J082154M56619K9068O50330J210022N87158k057953
1887.8G90154419k129135n36423K082443L095017K95868L6850L62777j994247k74811
1892.2G91092758J80435O86875L69110L15933j794586r45892J211013q3236J301193
1896.5G92333603P16476k515030j521301K891312K284622j693344k765122m69741k01798
$$ plain form
1900.9 789059677 790362396 792414322 790262375 788518524 788461609 788868256 790922165 791296921 790796280
1905.2 790796280 791210556 789887543 789217606 790919266 792170486 790980759 787975159 787152100 788492050
1909.5 788492050 789644852 790329666 787982941 787002716 788576736 788289413 787688828 787215729 788213120
1913.9 788213120 789810333 790450668 791598358 790776520 789685745 789062653 789467087 789644623 790286636
1918.2 790286636 791657639 790935364 791605682 791807404 789904633 788604431 789346161 789585953 791011887
1922.6 791011887 790750961 790341492 789792023 790729523 790173035 787241592 787649918 788630066 787986908
1926.9 787986908 787256241 788031693 788296280 789099045 788919754 789252777 789694443 788300629 787543335
1931.2 787543335 789439392 791258392 791187363 790559082 787317047 786057129 786884079 788354645 788355408
$$ packed form
1900.9G89059677J302719K051926k151947j743851n6915M06647K053909L74756n00641
1905.2G90796280M14276j323013o69937J701660J251220j189727l005600q23059J339950
1909.5G88492050J152802O84814k346725r80225J574020k87323o00585m73099R97391
1913.9G88213120J597213O40335J147690q21838j090775o23092M04434J77536O42013
1918.2G90286636J371003p22275O70318K01722j902771j300202P41730K39792J425934
1922.6G91011887k60926m09469n49469R37500n56488k931443M08326R80148o43158
1926.9G87986908p30667P75452K64587Q02765j79291L33023M41666j393814p57294
1931.2G87543335J896057J819000p1029o28281l242035j259918Q26950J470566P63
$$ plain form
1935.6 788355408 788267517 787595139 788275528 789450226 790484314 788915405 787442856 786086884 786506348
1939.9 786506348 789182129 789231262 785699921 785566940 788418732 786911545 785624695 784886627 784593658
1944.3 784593658 785164490 784242935 785120468 787014694 786219330 786508713 786479874 784597931 785035095
1948.6 785035095 785804291 786153030 785848770 784552307 784659348 783471451 784805145 786650696 786517715
1952.9 786517715 784919357 783345261 785570450 789100189 789897842 789717407 787773361 785999222 786032867
1957.3 786032867 785259399 785150909 787171555 787233582 786747131 786441422 788005447 787456436 788069534
1961.6 788069534 788320160 789176407 790756149 791074905 790203705 788678513 787867279 789887161 791686325
1966 791686325 789981155 788275909 789356613 791243973 790660248 788863983 788544312 787813950 787884064
$$ packed form
1935.6G88355408q7891o72378O80389J174698J034088j568909j472549j355972M19464
1939.9G86506348K675781M9133l531341j32981K851792j507187j286850p38068k92969
1944.3G84593658N70832r21555Q77533J894226p95364K89383k8839j881943M37164
1948.6G85035095P69196L48739l04260j296463J07041j187897J333694J845551j32981
1952.9G86517715j598358j574096K225189L529739P97653j80435j944046j774139L3645
1957.3G86032867p73468j08490K020646O2027m86451l05709J564025n49011O13098
1961.6G88069534K50626Q56247J579742L18756q71200j525192q11234K019882J799164
1966G91686325j705170j705246J080704J887360n83725j796265l19671p30362P0114
$$ plain form
1970.3 787884064 788873978 790996933 791561508 788813171 787836456 789316635 789279556 788081512 788946304
1974.6 788946304 788823318 788956451 788001938 786622467 788064575 788038406 788024750 790765533 791051636
1979 791051636 790006943 789554672 789233704 788043671 786898575 788764420 790006866 789022827 788453827
1983.3 788453827 788361816 789503403 788764725 788286285 788681107 791067505 792302933 790833740 789189224
1987.7 789189224 790391769 790439987 791346512 791736832 789947281 788783798 791230164 791695328 789706192
1992 789706192 789934540 788926544 789999771 791224060 790899658 791804657 790308456 789665375 790016708
1996.3 790016708 789909286 790375595 790910568 789734268 789719849 791660843 792571487 792048569 790745392
2000.7 790745392 790873337 791580887 792608261 792570038 791441956 792019272 792221909 789431534 788281403
$$ packed form
1970.3G87884064R89914K122955N64575k748337r76715J480179l7079j198044Q64792
1974.6G88946304j22986J33133r54513j379471J442108k6169j3656K740783K86103
1979G91051636j044693m52271l20968j190033j145096J865845J242446r84039n69000
1983.3G88453827r2011J141587p38678m78440L94822K386398J235428j469193j644516
1987.7G89189224J202545M8218R06525L90320j789551j163483K446366M65164j989136
1992G89706192K28348j007996J073227J224289l24402R04999j496201o43081L51333
1996.3G90016708j07422M66309N34973j176300j4419J940994R10644n22918j303177
2000.7G90745392J27945P07550J027374l8223j128082N77316K02637k790375j150131
$$ plain form
2005 788281403 789376373 788955612 788646088 789057159 790002518 786962814 785867081 788299255 790847855
2009.4 790847855 790496445 789952011 789684677 788777390 788496017 789438782 789453735 789454727 790248795 790865631
2014.2 790865631 791814957 791335907 789057159 791908188 793876114 792556839 790892258 790779953 791860809
2018.5 791860809 791367569 789199753 787622070 787121124 789523697 790435715 789660339 790215378 790428925
2022.9 790428925 790130234 790045624 789969864 789245987 789242325 789985809 789979553 791818314 793140564 790774307
2027.7 790774307 789016190 790648956 792472763 788914108 788319702 789936752 787498245 786679077 788843231
2032 788843231 789553299 788846359 788525391 788204575 788825302 791386948 790657501 786991730 788005295
2036.4 788005295 790726395 790126724 787175903 786507416 788812866 789243469 789332199 785298462 783200607
$$ packed form
2005G88281403J094970m20761l09524M11071R45359l039704j095733K432174K548600
2009.4G90847855l51410n44434k67334r07287k81373R42765J4953R92P94068O16836
2014.2G90865631R49326m79050k278748K851029J967926j319275j664581j12305J080856
2018.5G91860809m93240k167816j577683n00946K402573R12018p75376N55039K13547
2022.9G90428925k98691q4610p5760p23877l662P43484o256J838761J322250k366257
2027.7G90774307j758117J632766J823807l558655n94406J617050k438507q19168K164154
2032G88843231P10068p06940l20968l20816O20727K561646p29447l665771J013565
2036.4G88005295K721100n99671k950821o68487K305450M30603Q8730m033737k097855
$$ plain form
2040.7 783200607 785728683 785928192 786902847 788646545 788342972 786289673 785492706 786729813 786546021
2045 786546021 786547775 786682510 787530823 788215103 787980499 787938385 787314606 786377945 785906143 784881973
2049.9 784881973 785078201 785876083 784480743 785990982 789118195 785254822 782308273 783534470 782667618
2054.2 782667618 782615662 784034653 786766968 786955338 783422394 780767212 783360214 785418701 786664886
2058.5 786664886 787309036 787143860 785856247 784902573 786148148 786639862 786111450 784148331 783680038
2062.9 783680038 784743958 785831528 788085556 785825043 783896484 784458618 785106430 784075089 782176361
2067.2 782176361 782479630 782963715 783624115 784939041 784614944 784268570 786165924 787159119 786640930
2071.6 786640930 786070175 786973038 787261734 787918320 787102051 786279526 784407272 782867050 783621902
$$ packed form
2040.7G83200607K528076J99509R74655J743698l03573k053299p96967J237107j83792
2045G86546021J754J34735Q48313O84280k34604m2114o23779r36661m71802j024170
2049.9G84881973J96228P97882j395340J510239L127213l863373k946549J226197q66852
2054.2G82667618n1956J418991K732315J88370l532944k655182K593002K058487J246185
2058.5G86664886O44150j65176j287613r53674J245575M91714n28412j963119m68293
2062.9G83680038J063920J087570K254028k260513j928559N62134O47812j031341j898728
2067.2G82176361L03269M84085O60400J314926l24097l46374J897354R93195n18189
2071.6G86640930n70755R02863K88696O56586q16269q22525j872254j540222P54852
$$ plain form
2075.9 783621902 784509277 786362534 786734772 783556747 782140503 784427567 785626755 786361389 788172455
2080.2 788172455 788872375 786466064 783198929 783928680 785205612 785108719 784604874 784649124 784088516
2084.6 784088516 786671448 787831879 784715195 784312286 786809082 788241119 787481079 784334946 783084564
2088.9 783084564 785219116 787129669 787294464 788867569 789049225 787762299 785692368 784366074 784955292
2093.3 784955292 786379318 785737610 785024872 786314316 785979309 786510773 786803589 785749435 787771606
2097.6 787771606 786872482 784517593 784832764 787039566 786912231 785217361 784542923 786516647 788085937
2101.9 788085937 786337738 785434189 786415634 785237122 784399719 785717697 788110580 787454529 786127396
2106.3 786127396 786273346 786542206 786757507 787654724 790819016 790928497 790092926 787874680 786445312
$$ packed form
2075.9G83621902Q87375J853257L72238l178025j416244K287064J199188P34634J811066
2080.2G88172455O99920k406311l267135P29751J276932r6893n03845M4250n60608
2084.6G84088516K582932J160431l116684m02909K496796J432037p60040l146133j250382
2088.9G83084564K134552J910553J64795J573105J81656j286926k069931j326294N89218
2093.3G84955292J424026o41708p12738J289444l35007N31464K92816j054154K022171
2097.6G87771606q99124k354889L15171K206802j27335j694870o74438J973724J569290
2101.9G88085937j748199r03549R81445j178512q37403J317978K392883o56051j327133
2106.3G86127396J45950K68860K15301Q97217L164292J09481q35571k218246j429368
$$ plain form
2110.6 786445312 787342453 786212769 785892944 788797226 789654007 788616486 787595444 787891006 789333649
2115 789333649 789963226 790445786 788319855 786622238 784952316 785732269 788802490 789934540 789054260
2119.3 789054260 788552399 790194550 789706497 789021606 788487778 785608139 785736313 785690994 783719559
2123.6 783719559 786021957 788494339 789804459 790099716 787878799 786280899 786941299 788096924 787517090
2128 787517090 787470932 787502441 784987259 784719391 786466522 786466980 786053162 787259979 787466507 786016693
2132.8 786016693 787406616 787607880 786576385 787308273 787405930 786731262 787876282 790547256 791239700
2137.1 791239700 789689178 787301407 787743301 789184799 787584839 787229385 787431030 787355042 788190613
2141.5 788190613 787805176 787000961 785581207 785707932 789409790 789859085 788742752 787726669 788006897
$$ packed form
2110.6G86445312Q97141j129684l19825K904282Q56781j037521j021042K95562J442643
2115G89333649O29577M82560k125931j697617j669922P79953L070221J132050q80280
2119.3G89054260n01861J642151m88053o84891n33828k879639J28174m5319j971435
2123.6G83719559K302398K472382J310120K95257k220917j597900O60400J155625n79834
2128G87517090m6158L1509k515182k67868J747131M58m13818J206817K06528j449814
2132.8G86016693J389923K01264j031495P31888R7657o74668J145020K670974O92444
2137.1G91239700j550522k387771M41894J441498j599960l55454K01645p5988Q35571
2141.5G88190613l85437q04215j419754J26725L701858M49295j116333j016083K80228
$$ plain form
2145.8 788006897 788088913 786735229 786893463 786378098 786357346 786699524 787088165 787703934 787928848 787222977
2150.6 787222977 787228165 786200562 787005157 787333755 787278214 789168472 788915024 788669586 789663315 789111404
2155.5 789111404 788465958 787097549 784546051 786422501 788332748 788000793 786752930 786907578 787255936
2159.8 787255936 789556885 791370010 789877930 785928192 785001907 786562729 787681656 787289581 787555771
2164.1 787555771 787843170 788565292 788985138 788336792 788994827 789345322 787420273 787520294 788513489
2168.5 788513489 787355194 787298508 788266449 787830200 787499771 788033981 788751221 788325500 789047165 789799194
2173.3 789799194 788320236 787015915 786457443 786483688 784970169 784314957 786218109 787768936 789165268
2177.7 789165268 788927460 788430634 789244537 788721085 786925659 786002045 787579880 790677719 792082596
$$ packed form
2145.8G88006897Q2016j353684J58234n15365k0752L42178L88641O15769K24914p05871
2150.6G87222977N188j027603Q04595L28598n5541J890258k53448k45438R93729n51911
2155.5G89111404o45446j368409k551498J876450J910247l31955j247863J54648L48358
2159.8G87255936K300949J813125j492080l949738r26285J560822J118927l92075K66190
2164.1G87555771K87399P22122M19846o48346O58035L50495j925049J00021R93195
2168.5G88513489j158295n6686R67941m36249l30429N34210P17240m25721P21665P52029
2173.3G89799194j478958j304321n58472K6245j513519o55212J903152J550827J396332
2177.7G89165268k37808m96826Q13903n23452j795426r23614J577835L097839J404877
$$ plain form
2182 792082596 789875717 787656708 787774582 788006744 787935333 788411026 788397446 787174454 787721481 787680206
2186.8 787680206 786856003 786765976 787829514 786455383 785078430 785562820 786585617 788672943 790682983
2191.2 790682983 791194458 789849854 788652039 788286057 789971619 789940796 787645187 786400986 786758194
2195.5 786758194 787199020 786043243 784633942 785730667 787510300 788079758 788786469 789452667 790295105
2199.8 790295105 788838959 787105942 787983932 788618164 788452072 787870712 786027603 786555176 787155304
2204.2 787155304 786708908 786259155 786991806 787379608 786744080 784907150 783274307 785527191 787341995
2208.5 787341995 785579758 784226761 784009933 783708572 784758530 784259644 784002380 783811493 782465973
2212.9 782465973 784858780 785551910 786170197 787898254 785015030 782545090 783095703 784192657 785491791
$$ packed form
2182G92082596k206879k219009J17874K32162p1411M75693j3580j222992N47027m1275
2186.8G87680206q24203r0027J063538j374131j376953M84390J022797K087326K010040
2191.2G90682983N11475j344604j197815l65982J685562l0823k295609j244201L57208
2195.5G86758194M40826j155777j409301J096725J779633N69458P06711O66198Q42438
2199.8G90295105j456146j733017Q77990O34232j66092n81360j843109N27573O00128
2204.2G87155304m46396m49753P32651L87802o35528j836930j632843K252884J814804
2208.5G87341995j762237j352997k16828l01361J049958m98886k57264j90887j345520
2212.9G82465973K392807O93130O18287J728057k883224k469940N50613J096954J299134
$$ plain form
2217.2 785491791 783496933 781573486 783458939 783841400 783629379 784137573 784423141 783452301 783380585
2221.5 783380585 785862656 784689102 782547455 782467804 784069595 783719177 782020645 782215729 782425842
2225.9 782425842 782895508 782171860 782218628 782040482 784136581 786844559 786202087 785387878 784054718
2230.2 784054718 783876724 783793106 783442917 783321533 782518692 782918320 783281479 783607864 783608856 785040894
2235 785040894 783436279 782651443 784365005 786407013 787256546 785028763 785561371 786350708 785286865
2239.4 785286865 785038223 784469223 785816269 786002655 784986343 784078903 783551483 784675064 786307526
2243.7 786307526 787108917 789085083 788884201 786071930 784980316 784910202 783250961 784083481 786944046
2248.1 786944046 787985992 786836319 786014938 785033264 785194321 785046844 784517441 785928726 786197739
$$ packed form
2217.2G85491791j994858j923447J885453L82461k12021N08194K85568r70840p1716
2221.5G83380585K482071j173554k141647p9651J601791l50418j698532J95084K10113
2225.9G82425842M69666p23648M6768j78146K096099K707978o42472q14209j333160
2230.2G84054718j77994q3618l50189j21384q02841L99628L63159L26385R92J432038
2235G85040894j604615p84836J713562K042008Q49533k227783N32608P89337j063843
2239.4G85286865k48642n69000J347046J86386j016312r07440n27420J123581J632462
2243.7G86307526Q01391J976166k00882k812271j091614p0114j659241Q32520K860565
2248.1G86944046J041946j149673q21381r81674J61057j47477n29403J411285K69013
$$ plain form
2252.4 786197739 785250702 787223663 790329514 789351578 788647690 788802795 788196335 786053925 784299698
2256.7 784299698 784788132 785679092 787538834 787055969 785541763 787410355 788330154 788019104 789870071
2261.1 789870071 788652267 787557907 787282028 787932587 788264618 788554459 789956360 790154953 788334732
2265.4 788334732 787630997 788338165 788786011 790196609 789427567 788789291 788913879 789640121 788818054
2269.8 788818054 787643585 787789764 787752762 791600647 794582825 793404694 791033859 789021225 786593857
2274.1 786593857 785774384 789627838 790769958 788943176 787270584 786199265 785582199 786045303 787141953
2278.4 787141953 788972321 788527527 787633743 787140350 787389832 787271652 788319931 789342957 789749146
2282.8 789749146 789902344 787116547 785509491 786536636 785991974 787154236 787748413 789069901 787794647
$$ packed form
2252.4G86197739r47037J972961L105851r77936p03888J55105o06460k142410j754227
2256.7G84299698M88434Q90960J859742m82865j514206J868592R19799l11050J850967
2261.1G89870071j217804j094360k75879O50559L32031K89841J401901J98593j820221
2265.4G88334732p03735P07168M47846J410598p69042o38276J24588P26242q22067
2269.8G88818054j174469J46179l7002L847885K982178j178131k370835k012634k427368
2274.1G86593857q19473L853454J142120j826782j672592j071319o17066M63104J096650
2278.4G87141953J830368m44794q93784m93393K49482j18180J048279J023026M06189
2282.8G89749146J53198k785797j607056J027145n44662J162262N94177J321488j275254
$$ plain form
2287.1 787794647 786947708 787367172 789242783 789759979 788843231 789046631 788928986 789556656 789491272 788833389
2291.9 788833389 787062683 786449432 789081192 790353394 790565109 790114822 791008301 791858749 791664581
2296.3 791664581 791084900 792945251 794728775 795882874 795937805 793215332 794782867 798382492 798484497
2300.6 798484497 795461273 790185471 790642548 793390732 795205612 791107864 793680954 796651764
2304.5 796651764 793742523 789727173 791974564 797796555 800434036 802092972 800529175 800475845 804601669
2308.8 804601669 806667175 798947906 798172836 806079712 809362717 805707474 800904770 805215454
2312.7 805215454 808926163 809369888 804840698 806162491 808340836 805065536 800735474 802629776
2316.5 802629776 807555237 809821548 807311401 808297577 813681030 821912689 817823563 810995712
$$ packed form
2287.1G87794647q46939M19464J875611N17196r16748K03400j17645O27670o5384o57883
2291.9G88833389j770706o13251K631760J272202K11715m50287Q93479Q50448j94168
2296.3G91664581n79681J860351J783524J154099N4931k722473J567535L599625J02005
2300.6G98484497l023224n275802M57077K748184J814880m097748K573090K970810
2304.5G96651764k909241m015350K247391N821991K637481J658936j563797n3330M125824
2308.8H04601669K065506p719269p75070P906876L283005l655243m802704M310684
2312.7H05215454L710709M43725m529190J321793K178345l275300m330062J894302
2316.5H02629776M925461K266311k510147R86176N383453Q231659m089126o827851
$$ plain form
2320.4 810995712 818703232 824034500 816656342 815918503 823626404 829091110 822247543 817201157
2324.2 817201157 821660843 826137543 822470093 822368164 829378357 831351318 822839203 822133865 827751160
2328.6 827751160 828807602 824084244 819684753 825770187 830681458 828648148 825525131 827181702
2332.4 827181702 829184799 826899643 827191925 832896042 827274933 827484360 837814789 840983124
2336.3 840983124 835362778 829788666 832655487 837229233 832464752 824298859 830074539 830029526 823356628
2340.6 823356628 829535446 834528732 832885132 830655365 831270752 830130844 828036423 827919083 825576401
2345 825576401 823765717 825711212 825932236 820444412 816750946 815130692 809052811 805387421 810234451
2349.3 810234451 820891953 825536728 822330933 824141769 829663696 828569946 832390213 840898361
$$ packed form
2320.4H10995712P707520N331268p378158p37839P707901N464706o843567n046386
2324.2H17201157M459686M476700l667450j01929P010193J972961q512115p05338N617295
2328.6H27751160J056442m723358m399491O085434M911271k033310l123017J656571
2332.4H27181702K003097k285156K92282N704117n621109K09427J0330429L168335
2336.3H40983124n620346n574112K866821M573746m764481q165893N775680m5013o672898
2340.6H23356628O178818M993286j643600k229767O15387j139908k094421j17340k342682
2345H25576401j810684J945495K21024n487824l693466j620254o077881l665390M847030
2349.3H10234451J0657502M644775l205795J810836N521927j093750L820267Q508148
$$ plain form
2353.2 840898361 840967407 833384323 835917892 836761627 835796967 847782745 853218079 846493988 844202881
2357.5 844202881 844280777 843447266 853516846 852048187 841650543 846597214 850575027 846244965
2361.4 846244965 851572647 858285599 845955887 844458618 845732574 847771835 854207001 847038803
2365.2 847038803 845107269 844215851 838300934 843512955 840079498 834675293 829340897 825363235
2369.1 825363235 829474716 824861832 820300446 824168625 826345901 827006836 818750610 815012970
2372.9 815012970 810130081 808601074 807580566 805589828 807476044 807000198 808021774 806540146
2376.8 806540146 803971024 801608734 802319641 801131592 799041367 795977936 795413361 793277969 792302322
2381.1 792302322 792803192 792436142 791975784 789291992 786913223 786069794 785536194 785256653 785089417
$$ packed form
2353.2H40898361O9046p583084K533569Q43735r64660J1985778N435334o724091k291107
2357.5H44202881P7896q33511J0069580j468659j0397644M946671L977813m330062
2361.4H46244965N327682O712952j2329712j497269J273956K039261O435166p168198
2365.2H47038803j931534q91418n914917N212021l433457n404205n334396l977662
2369.1H25363235M111481m612884m561386L868179K177276O60935q256226l737640
2372.9H15012970m882889j529007j020508j990738J886216m75846J021576j481628
2376.8H06540146k569122k362290P10907j188049k090225l063431n64575k135392r75647
2381.1G92302322N00870l67050m60358k683792k378769q43429n33600k79541j67236
$$ plain form
2385.5 785089417 786034012 786515198 787098923 787142029 786137772 786674652 787922745 785345688 784941940
2389.8 784941940 787530975 784858093 782411194 784527283 785563202 784926529 783799820 782520752
2393.7 782520752 783038330 784468155 784648056 784942551 786279907 785473404 782631378 782621841 782259064
2398 782259064 782409210 784904861 783233871 783852081 784989395 784214249 785483475 785563965 785014877
2402.4 785014877 783286438 781741943 782585526 783255692 782649994 782568207 783548584 784290237 782955856
2406.7 782955856 780700455 781308212 782630768 783485336 782662048 782925797 784527893 786286240 784363098
2411 784363098 781968231 780584793 780725327 782857666 783471832 783650436 785087662 786553802 784973984
2415.4 784973984 781465530 782371674 785554504 785431061 784590149 782950592 782605057 785191040 784099503
$$ packed form
2385.5G85089417R44595M81186N83725M3106j004257N36880J248093k577057m03748
2389.8G84941940K589035k672882k446899K116089J035919o36673j126709j279068
2393.7G82520752N17578J429825J79901K94495J337356q06503k842026r537l62777
2398G82259064J50146K495651j670990O18210J137314p75146J269226Q0490n49088
2402.4G85014877j728439j544495Q43583O70166o05698q1787R80377P41653j334381
2406.7G82955856k255401O07757J322556Q54568q23288K63749J602096J758347j923142
2411G84363098k394867j383438J40534K132339O14166J78604J437226J466140j579818
2415.4G84973984l508454R06144L182830j23443q40912j639557l45535K585983j091537
$$ plain form
2419.7 784099503 781603622 779532471 780922241 782756729 783983154 783644409 782505875 781819382 780928192
2424.1 780928192 780145035 781262360 782966843 785490875 784885254 783521576 783243256 781743469 782776337
2428.4 782776337 782993317 784512024 785855865 783838272 782451706 783828735 783458862 782766571 783155060
2432.7 783155060 783477554 784163971 785485229 785408020 784336014 784207916 784792938 784378738 785181885
2437.1 785181885 785639038 783193588 781228180 781547546 782858887 784183884 786235657 784224777 781353378
2441.4 781353378 781392517 783193436 783150406 784888077 785728836 785190353 785065308 784063034 783208084
2445.8 783208084 783943939 783404846 781406937 782712097 783857269 784283905 783772812 782527466 783943176
2450.1 783943176 783975983 784442368 785748978 785708008 784112091 784020233 784885941 783646317 782776794 782421951
$$ packed form
2419.7G84099503k495881k071151J389770J834488J226425l38745j138534o86493q91190
2424.1G80928192p83157J117325J704483K524032o05621j363678k78320j499787J032868
2428.4G82776337K16980J518707J343841k017593j386566J377029l69873o92291L88489
2432.7G83155060L22494O86417J321258p7209j072006j28098N85022m14200Q03147
2437.1G85181885M57153k445450j965408L19366J311341J324997K051773k010880k871399
2441.4G81353378L9139J800919m3030J737671Q40759n38483j25045j002274q54950
2445.8G83208084P35855n39093j997909J305160J145172M26636n11093j245346J415710
2450.1G83943176L2807M66385J306610m0970j595917r1858Q65708j239624q69523l54843
$$ plain form
2454.9 782421951 780834122 780936508 784850006 785486984 784937363 786020584 784863663 783272400 782753372
2459.3 782753372 782335892 781692276 782791519 783427658 781055374 780177994 783644714 784717331 783070831
2463.6 783070831 781828995 780979614 781100998 782680664 783935013 783768539 782850418 781247101 780708542
2467.9 780708542 780442429 780688324 781203690 782795258 783200836 782006607 780708771 781018524 784916992
2472.3 784916992 784727325 784421158 785046005 784547882 782122269 780474777 782841415 785075302 782726288
2476.6 782726288 780796204 780444260 778753052 778590698 779802322 780898056 782022934 782711792 783558884
2481 783558884 783494186 783707428 783219147 782832947 782694702 782549667 780450439 779151917 779624405 780599823
2485.8 780599823 780315323 779054718 780186081 782180939 782709274 781889725 781366806 782142181 781550674
$$ packed form
2454.9G82421951j587829J02386L913498O36978n49621J083221j156921j591263n19028
2459.3G82753372m17480o43616J099243O36139k372284q77380L466720J072617j646500
2463.6G83070831j241836q49381J21384J579666J254349j66474r18121j603317n38559
2467.9G80708542k66113K45895N15366J591568M05578j194229j297836L09753L898468
2472.3G84916992j89667l06167O24847m98123k425613j647492K366638K233887k349014
2476.6G82726288j930084l51944j691208j62354J211624J095734J124878O88858Q47092
2481G83558884o4698K13242m88281l86200j38245j45035k099228j298522M72488R75418
2485.8G80599823k84500j260605J131363J994858N28335q19549n22919P75375n91507
$$ plain form
2490.1 781550674 780203552 782110367 780853958 779800110 781228790 781247177 782938385 783848419 782021713
2494.5 782021713 780242538 782175293 783153992 781778488 780379791 779868088 782420273 784503708 784562607
2498.8 784562607 784324875 784191208 783722763 781328583 781602325 782589951 781861115 782578201 783432693
2503.1 783432693 782943039 783438110 781707764 781501160 783824158 782473755 781510468 781638412 780282822
2507.5 780282822 781658630 781445160 783229294 783913803 783254852 781063461 780587082 779813156 779370193
2511.8 779370193 781108551 782449493 781972427 782150726 781456833 779484482 781016464 783614578 784367218
2516.2 784367218 784396973 785104523 784679108 784325333 785552139 785316925 784198914 782563553 782386627
2520.5 782386627 782840500 782898560 782403107 780657349 780928955 782872391 783484497 781728439 781311646
$$ packed form
2490.1G81550674j347122J906815j256409j053848J428680J8387J691208R10034j826706
2494.5G82021713j779175J932755R78699j375504j398697n11703K552185K083435N8899
2498.8G84562607k37732j33667m68445k394180K73742R87626p28836P17086Q54492
2503.1G83432693m89654M95071j730346k06604K322998j350403r63287J27944j355590
2507.5G80282822J375808k13470J784134O84509o58951k191391m76379p73926m42963
2511.8G79370193J738358J340942m77066J78299o93893j972351J531982K598114P52640
2516.2G84367218K9755P07550m25415l53775J226806k35214j118011j635361j76926
2520.5G82386627M53873N8060m95453j745758K71606J943436O12106j756058m16793
$$ plain form
2524.8 781311646 783133087 781819534 781081085 782622910 782244186 784247437 785573044 785322342 783798599
2529.2 783798599 781689148 781609344 782104187 782912827 782883835 784159546 786026688 784616165 784782181
2533.5 784782181 783442764 781037369 782130966 783398895 784442215 784651413 783279419 780793839
2537.4 780793839 781196823 783130646 781747818 779811554 781878052 782952957 783132248 781979828 781061783
2541.7 781061783 783200378 785010681 784010239 782790451 783244476 784629974 784889145 784398193 786624832
2546.1 786624832 787591324 784616928 779648209 778312454 779688492 780826645 782168045 783686066
2549.9 783686066 782836914 783543930 785274124 783483810 781087570 779822998 781609650 783650589 782967834
2554.3 782967834 782593918 782553406 782054825 780492706 782216110 783382721 779955597 780893631 782797775
$$ packed form
2524.8G81311646J821441j313553p38449J541825l78724K003251J325607k50702j523743
2529.2G83798599k109451p9804M94843Q08640k8992J275711J867142j410523J66016
2533.5G84782181j339417k405395J093597J267929J043320K09198j371994k485580
2537.4G80793839M02984J933823j382828j936264K066498J074905J79291j152420r18045
2541.7G81061783K138595J810303j000442j219788M54025J385498K59171m90952K226639
2546.1G86624832R66492k974396m968719j335755J376038J138153J341400J518021
2549.9G83686066q49152P07016J730194j790314k396240j264572J786652K040939o82755
2554.3G82967834l73916m0512m98581j562119J723404J166611l427124R38034J904144
$$ plain form
2558.6 782797775 782950745 783864670 783168030 780421295 781909866 781598740 779280624 781613235 783782883
2562.9 783782883 779958954 777853928 780310440 781672516 780651932 779635696 779816132 781555405
2566.8 781555405 782486801 782618408 784279175 782444839 780388336 780664062 780893631 780976486 781186371
2571.1 781186371 783584442 785025330 783832092 781619110 780357819 780771103 782028122 783003922 783908691
2575.5 783908691 783219223 782710495 780889740 779803391 781886444 784086990 782573547 778003311 779324646
2579.8 779324646 782309341 781564636 780286026 779409027 780704422 783207550 783236237 781979599 784391708
2584.2 784391708 784871902 783630219 784448090 783166733 781399002 780810318 781484222 780202560 778659058
2588.5 778659058 780857773 782050629 782756653 782758026 780996246 779708786 781337051 781707382 780741653
$$ packed form
2558.6G82797775J52970R13925o96640k746735J488571l11126k318116K332611K169648
2562.9G83782883l823929k105026K456512J362076j020584j016236J80436J739273
2566.8G81555405R31396J31607J660767j834336k056503K75726K29569Q2855K09885
2571.1G81186371K398071J440888j193238k212982j261291M13284J257019R75800R04769
2575.5G83908691o89468n08728j820755j086349K083053K200546j513443m570236J321335
2579.8G79324646K984695p44705j278610q76999J295395K503128K8687j256638K412109
2584.2G84391708M80194j241683Q17871j281357j767731n88684O73904j281662j543502
2588.5G78659058K198715J192856P06024J373j761780j287460J628265L70331r65729
$$ plain form
2592.8 780741653 779362030 779122543 783292313 783571930 780172577 779476929 781388626 782428589 781623764
2597.2 781623764 780855713 777554779 775986862 776945877 777687378 778747864 778590317 778226395 780090561
2601.5 780090561 777594223 776444855 778627548 779409485 778769455 778253021 779037704 778566284 778082275
2605.9 778082275 780702972 781050644 779932556 779717789 778428345 779805527 780707855 778718948 776853485
2610.2 776853485 777153702 779594498 781690521 781869278 779626236 778960724 781215134 782075729 778404922
2614.5 778404922 777313614 776781998 776096878 777020874 778667450 779002151 777569656 776668091 776326523
2618.9 776326523 776929169 779427032 778263931 778688431 781689148 781809692 779495773 778340759 777968216
2623.2 777968216 779013748 779594955 778850861 777696991 778239517 778865280 778964615 779489212 778961029
$$ packed form
2592.8G80741653j379623k39487M169770K79617l399353o95648J911697J039963q04825
2597.2G81623764p68051l300934j567917R59015P41501J060486j57547l63922J864166
2601.5G80090561k496338j149368K182693P81937o40030n16434P84683m71420m84009
2605.9G78082275K620697L47672j118088k14767j289444J377182R02328j988907j865463
2610.2G76853485L00217K440796K096023J78757k243042o65512K254410Q60595l670807
2614.5G78404922j091308n31616o85120R23996J646576L34701j432495r01565l41568
2618.9G76326523O02646K497863j163101M24500L000717J20544k313919j155014l72543
2623.2G77968216J045532N81207p44094j153870N42526O25763R9335N24597n28183
$$ plain form
2627.6 778961029 780236893 781212921 780270309 780305405 778648911 777388306 776031723 776299744 779827881
2631.9 779827881 779423447 775799332 774592743 776756744 778567505 779599075 779762726 780046387 779247818
2636.2 779247818 779111633 780502853 781845703 779971542 779943695 779773483 778263397 777358627 777674942
2640.6 777674942 778214798 778520050 780481796 780774231 779677353 778525620 777798157 778357697 781029510
2644.9 781029510 783192825 782751846 781818237 780846634 778592911 778329086 779827728 781365967 780787125
2649.3 780787125 780744858 781678391 780994568 778114319 777730255 779297714 779729462 780595703 780457077
2653.6 780457077 780606537 779594498 777890320 777655182 778315582 780385666 780356903 778773804 781577225
2657.9 781577225 784577789 782142563 777765579 776286545 779162674 781097260 779808960 779774399 778908005
$$ packed form
2627.6G78961029J275864R76028r42612L5096j656494j260605j356583K68021L528137
2631.9G79827881m04434l624115j206589K164001J810761J031570J63651K83661p98569
2636.2G79247818j36185J391220J342850j874161k7847j70212j510086r04770L16315
2640.6G77674942N39856L05252J961746K92435j096878j151733p27463N59540K671813
2644.9G81029510K163315m40979r33609r71603k253723k63825J498642J538239n78842
2649.3G80787125m2267R33533o83823k880249l84064J567459M31748Q66241j38626
2653.6G80457077J49460j012039j704178k35138O60400K070084k8763j583099K803421
2657.9G81577225L000564k435226m376984j479034K876129J934586j288300l4561q66394
$$ plain form
2662.3 778908005 777428360 776943207 778316956 779571762 779234238 778239975 777360382 778168182 781004868
2666.6 781004868 781392517 777658310 775884705 777074661 776813736 777853851 780150757 779696808 778965912
2670.9 778965912 777449799 775516129 776693497 778418274 777198257 776326904 777345200 777005539 779373703
2675.3 779373703 780623703 779807053 777769165 777143173 777863388 775946808 774747314 774831924 773746490
2679.6 773746490 775586472 777469940 775706329 776963043 778483887 777467270 779595795 779657974 778505173
2684 778505173 780100937 780123672 779591064 778705139 777209015 778607330 779170151 778398209 778282242 776774368
2688.8 776774368 774459457 773886337 775220718 775875854 774631500 775003662 776308517 775489655 775020294
2693.1 775020294 774681778 773414307 772767868 775518188 779566040 780070419 779139557 779436111 779475784
$$ packed form
2662.3G78908005j479645m85153J373749J254806l37524r94263q79593Q07800K836686
2666.6G81004868L87649l734207j773605J189956k60925J040115K296906m53949p30896
2670.9G78965912j516113j933670J177368J724777j220017q71353J018296l39661K368164
2675.3G79373703J250000q16650k037888o25992P20215j916580j199494Q4610j085434
2679.6G73746490J839982J883468j763611J256714J520844j016617K128525O2179j152801
2684G78505173J595764K2735n32608q85925j496124J398315N62821p71942j15967j507874
2688.8G76774368k314911n73120J334381O55136j244354L72162J304855q18862m69361
2693.1G75020294l38516j267471o46439K750320M047852N04379r30862K96554L9673
$$ plain form
2697.5 779475784 777393646 774240952 774025345 774912491 776946640 778518295 779404602 776220551 774646301
2701.8 774646301 775336838 775135574 774199905 776230927 777236328 777040405 776856155 774302444 772887726
2706.2 772887726 775415649 776216736 774490662 777013550 779597244 778109207 776708908 776737289 775845184
2710.5 775845184 775568085 775964279 776027145 773488312 772819443 772454453 773149414 773396912 770889359
2714.8 770889359 771321259 772820663 772080002 772022781 769170380 769914474 772300415 773139877 771760941
2719.2 771760941 771489944 771633682 770851746 771247406 770828476 769459610 769463654 770492859 770336075 769256821
2724 769256821 766978912 765228577 764914246 764055862 762443619 763480301 764685974 766258469 765171585
2728.3 765171585 763859329 766897049 767559128 765581284 762396393 760660858 762583160 761805267 763847656
$$ packed form
2697.5G79475784k082138l152694k15607Q87146K034149J571655Q86307l184051j574250
2701.8G74646301O90537k01264r35669K031022J005401j95923j84250k553711j414718
2706.2G72887726K527923Q01087j726074K522888K583694j488037j400299K8381q92105
2710.5G75845184k77099L96194O2866k538833o68869l64990O94961K47498k507553
2714.8G70889359M31900J499404p40661n7221k852401P44094K385941Q39462j378936
2719.2G71760941k70997J43738p81936L95660m18930j368866M044J029205j56784j079254
2724G69256821k277909j750335l14331q58384j612243J036682J205673J572495j086884
2728.3G65171585j312256L037720O62079j977844l184891j735535J922302p77893K042389
$$ plain form
2732.7 763847656 765233688 764080048 763798370 763114700 764356918 765087204 763826828 765287857 764882660
2737 764882660 764492416 765099564 765412521 766417999 768124008 769344559 768318405 767016525 770121460
2741.4 770121460 769419022 767543182 767861481 766096344 767756195 769187469 768960190 768456573 765714035
2745.7 765714035 765146561 767882080 769952774 768617859 768749466 772200775 772291718 770727768 772041550
2750 772041550 772954636 771803131 769769211 767819290 768884811 770987244 771010666 769102020 767180862
2754.4 767180862 769537430 772573471 769594650 766716843 767848740 770724411 770855713 767572937
2758.2 767572937 766603622 771410522 771630707 767607880 767083130 766257706 766771240 768823166 767602539
2762.6 767602539 769710693 773007202 772377396 770579605 769259186 770281677 771062546 771382065 769225464
$$ packed form
2732.7G63847656J386032j153640k81678o83670J242218P30286j260376J461029m05197
2737G64882660l90244O07148L12957J005478J706009J220551j026154j301880L104935
2741.4G70121460p02438j875840L18299j765137J659851J431274k27279n03617k742538
2745.7G65714035n67474K735519K070694j334915J31607L451309R0943j563950J313782
2750G72041550R13086j151505k033920j949921J065521K102433K3422j908646j921158
2754.4G67180862K356568L036041k978821k877807J131897K875671J31302l282776
2758.2G67572937r69315M806900K20185m022827n24750q25424N13534K051926j220627
2762.6G67602539K108154L296509o29806j797791j320419J022491P80869L19519k156601
$$ plain form
2766.9 769225464 766798706 768100739 769414139 770215836 769163818 769235992 771753616 769106064 765339127
2771.2 765339127 768871689 770177841 769911652 772498245 773450546 771451721 767563324 767342682 766173401
2775.6 766173401 767331848 770053558 767793961 765495682 764258118 765608597 769074783 769764328
2779.4 769764328 768617249 769941864 770975571 768774033 764761963 764663315 764694519 764938278 764761658
2783.8 764761658 765601273 763272247 762711792 765177689 766882401 768932114 766547623 765832672 767544937
2788.1 767544937 766956177 766376419 763144608 761679764 762316055 760393295 759807129 762112732 762489548
2792.5 762489548 760840530 761114349 760865479 759442749 757027435 757922897 760032654 761213913 760598297
2796.8 760598297 757237015 755054169 756755981 757487946 754550629 752853622 753519669 752907257 752686844
$$ packed form
2766.9G69225464k426758J302033J313400Q01697j052018P2174K517624k647552l766937
2771.2G65339127L532562J306152k66189K586593R52301j998825l888397k20642j169281
2775.6G66173401J158447K721710k259597k298279j237564J350479L466186O89545
2779.4G69764328j147079J324615J033707k201538m012070r8648L1204K43759j76620
2783.8G64761658Q39615k329026n60455K465897J704712K049713k384491p14951J712265
2788.1G67544937n88760n79758l231811j464844O36291j922760n86166K305603L76816
2792.5G62489548j649018K73819k48870j422730k415314Q95462K109757J181259o15616
2796.8G60598297l361282k182846J701812P31965k937317j697007O66047o12412k20413
$$ plain form
2801.1 752686844 753632507 754379578 753399200 750620346 749117584 749545135 749948654 749469604 749728775
2805.5 749728775 747772217 746447754 745789108 747184601 748246994 747344513 745022049 741553421 742217789
2809.8 742217789 740991745 739940491 740161362 736288834 734952240 736230927 737090530 737849121 736050644
2814.2 736050644 732313461 728900986 729045334 730589523 730777512 728688507 725802383 725091858 724760818
2818.5 724760818 723895874 723039932 723184814 722087936 719906845 719040680 718664551 716442261 712994385
2822.8 712994385 710450897 711024399 709459381 707036133 704608002 702930908 699821777 698140793
2826.7 698140793 696425018 693715134 692427826 690466766 686928940 683428955 680715714 682709427
2830.6 682709427 683117447 680538406 679227142 678514557 678278580 678822327 677676239 677634125 676785431
$$ packed form
2801.1G52686844R45663P47071r80378k778854j502762M27551M03519m79050K59171
2805.5G49728775j956558j324463o58646J395493J062393r02481k322464l468628O64368
2809.8G42217789j226044j051254K20871l872528j336594J278687Q59603P58591j798477
2814.2G36050644l737183l412475J44348J544189J87989k089005k886124p10525l31040
2818.5G24760818q64944q55942J44882j096878k181091q66165l76129k222290l447876
2822.8G12994385k543488N73502j565018k423248k428131j677094l109131j680984
2826.7F98140793j715775k709884j287308j961060l537826l499985k713241J993713
2830.6F82709427M08020k579041j311264p12585k35977N43747j146088m2114q48694
$$ plain form
2834.9 676785431 676802216 677783966 675370407 677316208 680290222 680573578 680201569 680456543 681379395
2839.2 681379395 680904236 681166687 680115128 679951019 677794266 676856461 677579575 676650314 671622772
2843.6 671622772 666796951 664326324 664093475 663202972 660067062 657743149 654894562 654862366 656728134
2847.9 656728134 651567535 643593063 640984497 643679657 643620148 640738678 636691666 634317627 635446663
2852.3 635446663 636957817 634963455 634046288 633807526 632235565 631494408 630913467 629368858 629549904
2856.6 629549904 631886826 633801498 633067474 635752144 638957062 638352737 636783791 635344429 635452499
2860.9 635452499 636471329 638484192 639871521 638658524 638923988 640391464 638597069 638750687 639036255
2865.3 639036255 637874908 638536034 639277916 637092590 633018684 630739250 629569855 629722061 629968224
$$ packed form
2834.9F76785431J6785R81750k413559J945801K974014K83356l72009K54974R22852
2839.2F81379395m75159K62451j051559j64109k156753r37805P23114r29261n027542
2843.6F71622772m825821k470627k32849q90503l135910k323913k848587l2196J865768
2847.9F56728134n160599p974472k608566K695160n9509k881470m047012k374039J129036
2852.3F35446663J511154j994362r17167k38762j571961p41157n80941j544609J81046
2856.6F29549904K336922J914672p34024K684670L204918o04325j568946j439362J08070
2860.9F35452499J018830K012863J387329j212997K65464J467476j794395J53618K85568
2865.3F39036255j161347O61126P41882k185326m073906k279434j169395J52206K46163
$$ plain form
2869.6 629968224 628868523 625688019 626691475 626607018 621788330 621985817 621477127 617439270 614496689
2874 614496689 609803085 604915733 602941895 600128784 597213974 596776047 595135231 592320671 590535469
2878.3 590535469 586501236 581952705 580474625 578561745 573913956 568970604 566150360 564555893
2882.2 564555893 561325836 558712616 557274628 557053223 555763206 551670189 547573738 546723061 549017487
2886.5 549017487 551086349 549926910 547467117 544834785 547166901 549675102 550096779 549345169 549434319
2890.8 549434319 551318321 553733559 556313057 559989700 560219307 558513718 559639854 562083244
2894.7 562083244 564171524 566276474 567123108 569116821 572835426 573816719 573459892 575219002 574678383
2899 574678383 574414444 577800026 579966545 580743446 580325317 582641106 586180573 582987404 581933250
$$ packed form
2869.6F29968224j099701l180504J003456q4457m818688J97487n08690m037857k942581
2874F14496689m693604m887352j973838k813111k914810m37927j640816k814560j785202
2878.3E90535469m034233m548531j478080j912880m647789m943352k820244j594467
2882.2E64555893l230057k613220j437988k21405j290017m093017m096451q50677K294426
2886.5E49017487K068862j159439k459793k632332K332116K508201M21677p51610Q9150
2890.8E49434319J884002K415238K579498L676643K29607j705589J126136K443390
2894.7E62083244K088280K104950Q46634J993713L718605R81293l56827J759110n40619
2899E74678383k63939L385582K166519P76901m18129K315789L539467l193169j054154
$$ plain form
2903.4 581933250 583465118 584096756 584243927 584120750 583557777 582718849 580962830 579809837 577323608
2907.7 577323608 575931053 576311035 573364410 570785446 567973633 562990417 559202957 557864304
2911.6 557864304 556461945 551014862 546142845 543384476 540668983 537987518 534659462 528950157
2915.4 528950157 521582565 517445908 512704926 506342773 500006065 496940498 494622345 491121216
2919.3 491121216 486062241 483192787 479506569 473794708 471651611 468684158 465917320 466775589
2923.1 466775589 464947052 466105461 468937454 469696541 472046089 475382080 479897385 487172852
2927 487172852 490955124 493870010 501469574 505805511 507682724 510579872 511787872 514550133 518885841
2931.3 518885841 522909508 526963005 531795654 535211716 536702385 536337357 536695557 534944420 533468781
$$ packed form
2903.4E81933250J531868O31638J47171j23177n62973q38928j756019j152993k486229
2907.7E77323608j392555L79982k946625k578964k811813m983216l787460j338653
2911.6E57864304j402359n447083m872017k758369k715493k681465l328056n709305
2915.4E28950157p367592m136657m740982o362153o336708l065567k318153l501129
2919.3D91121216n058975k869454l686218n711861k143097k967453k766838Q58269
2923.1D66775589j828537J158409K831993P59087K349548L335991M515305P275467
2927D87172852L782272K914886P599564M335937J877213K897148J208000K762261M335708
2931.3E18885841M023667M053497M832649L416062J490669l65028L58200j751137j475639
$$ plain form
2935.7 533468781 536296387 538234482 538018227 540172882 539254494 538463173 539422798 540643921 540448074
2940 540448074 537099915 534855118 536146469 538930511 538745003 538202667 540417824 540936699 540550423
2944.4 540550423 540887222 538597031 535601921 535496254 535696716 535328369 534027023 532857094 532299843
2948.7 532299843 531785774 528772354 526582336 526644630 523933945 522487831 523790207 525909081 526644974
2953 526644974 525565071 526238327 529695396 529862099 529266510 528757706 530563927 533076782 532877083
2957.4 532877083 533780479 535123215 535867882 534197731 533754959 535779533 537479668 538936577 535035934
2961.7 535035934 531699181 533358307 534996567 534791412 532601547 528861847 528415604 527189980 525407295
2966.1 525407295 521635361 518790779 517286491 516889610 514550362 513337975 515864944 517253647
$$ packed form
2935.7E33468781K827606J938095k16255K154655r18388p91321R59625J221123j95847
2940E40448074l348159k244797J291351K784042j85508n42336K215157N18875l86276
2944.4E40550423L36799k290191k995110j05667K00462l68347j301346j169929n57251
2948.7E32299843n14069l013420k190018O2294k710685j446114J302376K118874P35893
2953E26644974j079903O73256L457069J66703n95589n08804J806221K512855j99699
2957.4E32877083R03396J342736P44667j670151m42772K024574J700135J456909l900643
2961.7E35035934l336753J659126J638260k05155k189865l739700m46243j225624j782685
2966.1E25407295l771934k844582j504288l96881k339248j212387K526969J388703
$$ plain form
2969.9 517253647 514361992 513417091 515695305 515411606 516049995 518396683 520823975 521089325 522563515
2974.3 522563515 524535103 524432793 524745903 526352196 530743942 533786507 536414299 540501251 543778877
2978.6 543778877 543847427 545906601 554965782 559975891 561545334 566663551 571781883 572568436 573736725
2982.9 573736725 578434486 582929306 585644150 589368744 594052010 597416382 601383553 603876648
2986.8 603876648 601519814 603891678 612202721 618145981 619906044 620148506 624497223 628128319
2990.7 628128319 629363480 631411934 633443336 636595001 640015564 645406723 650287552 652451782
2994.5 652451782 653934021 657245255 661441422 665975952 669170609 669174118 673365402 678341675 678609848
2998.9 678609848 681248322 686219482 689664841 690175629 689858856 693027115 692998810 693275528 694636459
$$ packed form
2969.9E17253647k891655r44901K278214k83699O38389K346688K427292K65350J474190
2974.3E22563515J971588j02310L13110J606293M391746L042565K627792M086952L277626
2978.6E43778877O8550K059174R059181N010109J569443N118217N118332P86553J168289
2982.9E73736725M697761M494820K714844L724594M683266L364372L967171K493095
2986.8F03876648k356834K371864Q311043N943260J760063K42462M348717L631096
2990.7F28128319J235161K048454K031402L151665L420563N391159M880829K164230
2994.5F52451782J482239L311234M196167M534530L194657L509M191284M976273K68173
2998.9F78609848K638474M971160L445359N10788l16773L168259k8305K76718J360931
$$ plain form
3003.2 694636459 697848282 700024643 699863358 698214493 696114502 698172836 701722260 703560028
3007 703560028 704007416 703097687 703102112 704999313 705028534 703374557 702432938 702416458 700984802 698783035
3011.9 698783035 700096359 702698288 703014908 701308060 703397064 702081146 694340897 693730087 699278336
3016.2 699278336 701100540 697223816 695836563 697392044 695824127 694392471 692436371 692759247
3020.1 692759247 693407745 690868301 690968323 693587723 695705948 696401901 693106613 692357254 696261749
3024.4 696261749 697696838 697280350 697783279 699930267 702454376 702001114 701754837 703179626 704475708
3028.7 704475708 708982391 711133347 710874023 711335831 713303680 713957748 714028625 712325211 713266525
3033.1 713266525 716247025 717118759 716857758 716625290 719166794 720112457 718735123 721539612 723386459
$$ packed form
3003.2F94636459L211823K176361j61285j648865k099991K058334L549424J837768
3007G03560028M47388r09729M425J897201K9221j653977r41619j6480j431656k201767
3011.9F98783035J313324K601929L16620j706848K089004j315918p740249o10810N548249
3016.2F99278336J822204l876724j387253J555481j567917j431656j956100L22876
3020.1F92759247O48498k539444J00022K619400K118225O95953l295288p49359L904495
3024.4F96261749J435089m16488N02929K146988K524109m53262k46277J424789J296082
3028.7G04475708M506683K150956k59324M61808J967849O54068P0877j703414R41314
3033.1G13266525K980500Q71734k61001k32468K541504R45663j377334K804489J846847
$$ plain form
3037.4 723386459 727391510 729620972 727360077 726211472 730588989 731791153 730262299 728453293
3041.3 728453293 727077789 729662704 732638397 732181931 730417557 730838242 731760406 735141144 738120346
3045.6 738120346 735047226 734177017 734670334 735398560 735264435 735674057 733919830 734251633 734501801
3050 734501801 733141785 736340714 735971146 735871582 741977005 740941162 736481552 735882721 739471207
3054.3 739471207 738443375 737526779 738062897 738430405 738569183 735865479 733055649 734247589 737414780
3058.6 737414780 737526703 735840683 735541077 734417648 732924576 734556732 731834869 727311630 726212463
3063 726212463 725343781 724456482 724219513 723488541 720897903 716863098 715405350 713770828 710848694
3067.3 710848694 709896622 710834045 710578461 706687088 702548599 705168610 706057281 700704956 694777222
$$ packed form
3037.4G23386459M005051K229462k260895j148605M377517J202164j528854j809006
3041.3G28453293j375504K584915K975693m56466j764374M20685R22164L380738K979202
3045.6G38120346l073120q70209M93317P28226j34125M09622j754227L31803K50168
3050G34501801j360016L198929l69568r9564O105423j035843m459610n98831L588486
3054.3G39471207j027832r16596N36118L67508J38778k703704k809830J191940L167191
3058.6G37414780J11923j686020k99606j123429j493072J632156k721863m523239j099167
3063G26212463q68682q87299k36969p30972k590638m034805j457748j634522k922134
3067.3G10848694r52072R37423k55584l891373m138489K620011Q88671n352325n927734
$$ plain form
3071.7 694777222 691261215 690572433 688678360 690934143 690330582 687965698 685945892 683194580 683520966
3076 683520966 684739380 687371216 688499146 688844910 690071793 685926895 680622406 681443176 683064499
3080.3 683064499 681839218 681767960 683207550 683995056 680575333 677880173 677601929 676618729 676306686
3084.7 676306686 673264694 673082581 673910904 677461777 680260773 684043503 689296494 691455917 694050064
3089 694050064 698919525 699386597 701277390 703803024 706255188 708003464 713118744 714295807 714623413
3093.4 714623413 720709076 723857880 723078537 722522659 729553680 735073318 734690399 733178558 731245193
3097.7 731245193 731756897 735707397 735799713 735386200 742657700 746151199 742630386 743930435 746461029
3102 746461029 746815643 747384720 744137650 743708038 747251587 745137634 745140152 751133041 753852921
$$ packed form
3071.7F94777222l516007o88782j894073K255783o03561k364884k019806k751312L26386
3076F83520966J218414K631836J127930L45764J226883m144898n304489Q20770J621323
3080.3F83064499j225281p1258J439590P87506l419723k695160k78244r83200l12043
3084.7F76306686l041992j82113Q28323L550873K798996L782730N252991K159423K594147
3089F94050064M869461M67072J890793K525634K452164J748276N115280J177063L27606
3093.4G14623413O085663L148804p79343n55878P031021N519638l82919j511841j933365
3097.7G31245193N11704L950500R2316m13513P271500L493499l520813J300049K530594
3102G46461029L54614N69077l247070m29612L543549k113953K518N992889K719880
$$ plain form
3106.4 753852921 751839905 750829315 749899902 749353638 750558243 752992172 752762909 752922745 752419281
3110.7 752419281 750411911 750794449 751447754 751340027 753408737 753680115 751049576 750911179 751504593
3115.1 751504593 754660034 757874527 756022797 755099716 755335388 755116501 754014664 750434341 752103271
3119.4 752103271 754908066 753818130 750494690 749811554 755597458 755494919 755543137 757980042 761834335
3123.7 761834335 763459244 759244995 756742859 756598740 758730164 758833008 758758926 754901886 750430756
3128.1 750430756 754164810 760030212 760787735 757438126 756578369 757627792 756212921 757143860 756444778
3132.4 756444778 754647369 755116577 757493439 756757278 755487366 758267593 759005356 756043930 756026535
3136.8 756026535 757007370 755987167 756120834 756318893 758969269 760487289 758147583 758192062 758995209
$$ packed form
3106.4G53852921k013016j010590r29413n46264J204605K433929k29263J59836n03464
3110.7G52419281k007370L82538O53305j07727K068710K71378k630539j38397N93414
3115.1G51504593L155441L214493j851730r23081K35672k18887j101837l580323J668930
3119.4G52103271K804795j089936l323440o83136N785904j02539M8218K436905L854293
3123.7G61834335J624909m214249k502136j44119K131424J02844p4082l857040m471130
3128.1G50430756L734054N865402P57523l349609q59757J049423j414871R30939o99082
3132.4G56444778j797409M69208K376862p36161j269912K780227P37763k961426j7395
3136.8G56026535R80835j020203J33667J98059K650376J518020k339706M4479Q03147
$$ plain form
3141.1 758995209 759020996 761240692 763935242 761540756 756984711 754624252 756721268 762178726 761563110
3145.4 761563110 759994659 754997559 756035614 760451584 760003662 761544876 760945740 757311020 756212158
3149.8 756212158 756035614 756108704 759887695 763133087 760850067 757901611 757381287 755974274 757972260
3154.1 757972260 760888290 757181015 758571014 764350739 761297379 756733322 758064270 755377426
3158 755377426 752986679 756542969 760647049 752348480 751402359 756585464 757645569 761430435 762387238
3162.3 762387238 760440292 755939865 759802704 762009735 758692017 757654037 758667755 759168472
3166.2 759168472 756781464 756784210 755983963 757237396 757048721 758226624 759808807 759394760 758193741
3170.5 758193741 757593002 758977051 757798004 754831696 755435028 757329712 758837204 758466339 755665894
$$ packed form
3141.1G58995209K5787K219696K694550k394486m556045k360459K097016N457458o15616
3145.4G61563110j568451m997100J038055M415970m47922J541214n99136l634720j098862
3149.8G56212158j76544P3090L778991L245392k283020k948456n20324j407013J997986
3154.1G57972260K916030l707275J389999N779725l053360m564057J330948k686844
3158G55377426k390747L556290M104080q298569r46121N183105J060105L784866R56803
3162.3G62387238j946946m500427L862839K207031l317718j037980J013718N00717
3166.2G59168472k387008K746q00247J253433j88675J177903J582183m14047j201019
3170.5G58193741o00739J384049j179047k966308O03332J894684J507492l70865k800445
$$ plain form
3174.9 755665894 755039520 754398804 756476822 757272186 755531921 755610962 757392578 758773270 758677826
3179.2 758677826 755423203 756468735 758993912 758642578 757447510 753076172 752126770 754173813 751333847
3183.5 751333847 754398270 754177246 754272919 761117096 762934036 758246918 754488373 756911087 761106873
3187.9 761106873 757943344 752214890 751646805 753920517 756662216 756668243 753045654 753653564 754419632
3192.2 754419632 754814606 755863342 757681274 756479645 758931885 764181747 760357056 755058823
3196.1 755058823 756614914 759258041 760705795 759978714 756347122 753092346 753646317 751552429 755216675
3200.4 755216675 758685989 754430466 752079544 755755463 756061935 751879272 752809525 756571655 757253876
3204.8 757253876 754376755 752065353 753791809 753984451 755792313 757339096 760597153 758059616
$$ packed form
3174.9G55665894o26374o40716K078018P95364j740265P9041J781616J380692r5444
3179.2G58677826l254623J045532K525177l51334j195068m371338r49402K047043k839966
3183.5G51333847L064423k21024R5673O844177J816940m687118l758545K422714M195786
3187.9G61106873l163529n728454n68085K273712K741699O027l622589O07910P66068
3192.2G54419632L94974J048736J817932j201629K452240N249862l824691n298233
3196.1G55058823J556091K643127J447754p27081l631592l254776N53971k093888L664246
3200.4G55216675L469314m255523k350922L675919L06472m182663R30253L762130O82221
3204.8G57253876k877121k311402J726456J92642J807862J546783L258057k537537
$$ plain form
3208.6 758059616 757573776 761066132 762980957 760934219 751524811 749357605 756555252 757703247
3212.5 757703247 755166245 755375900 752404022 749931793 751198044 752891159 752910233 754503098 753152466
3216.8 753152466 755300674 758253326 756341705 753690186 754388809 755152893 756054611 752912979 750328293
3221.1 750328293 753422318 754068222 751387482 752892838 754645691 756960602 756307983 754535675 751131897
3225.5 751131897 750320435 750292892 750569458 749912109 748962479 749426193 751751251 756370392 757053070
3229.8 757053070 755420303 753089981 752957458 754716415 754251785 752300949 750746384 750234222 750278091
3234.2 750278091 754560928 754593048 749137726 747497025 751660080 752580261 749809799 748352814 747280579
3238.5 747280579 748959579 750877380 751028137 751720657 753464737 754587708 755479813 751604996 747748032
$$ packed form
3208.6G58059616m85840L492356J914825k046738r409408k167206P197647J147995
3212.5G57703247k537002K09655k971878k472229J266251J693115J9074J592865j350632
3216.8G53152466K148208K952652j911621k651519O98623P64084R01718l141632k584686
3221.1G50328293L094025O45904k680740J505356J752853K314911o52619j772308l403778
3225.5G51131897q11462k7543K76566o57349r49630M63714K325058M619141O82678
3229.8G57053070j632767k330322j32523J758957m64630j950836j554565n12162M3869
3234.2G50278091M282837L2120n455322j640701M163055R20181k770462j456985j072235
3238.5G47280579J679000J917801J50757O92520J744080J122971Q92105l874817l856964
$$ plain form
3242.8 747748032 750976486 754675064 752720566 748450089 745073242 743408508 746615295 749911194
3246.7 749911194 752483368 751770935 749072189 748690796 749985733 753122025 752560959 748393631 746509323
3251 746509323 746280594 746473999 744423676 745759430 749251480 751812134 753332825 753122711 749100952
3255.4 749100952 746481323 745938492 744363327 744284134 747001038 749355927 747715759 748267822 748451614
3259.7 748451614 747401352 747585602 749085617 745905838 745747833 746113892 744064941 743763123 744375687
3264.1 744375687 745348587 742954025 741056900 742743454 744677811 744287415 744880600 746878204 746283569
3268.4 746283569 744798889 748889008 748744049 744564362 742526627 740855637 740542145 739352570 741756134
3272.7 741756134 742156143 740857468 743572159 743686447 741332321 742413864 747461853 747821808 743783951
$$ packed form
3242.8G47748032L228454L698578j954498m270477l376847j664734L206787L295899
3246.7G49911194K572174p12433k698746l81393J294937L136292n61066m167328j884308
3251G46509323k28729J93405k050323J335754L492050K560654J520691k10114m021759
3255.4G49100952k619629n42831j575165p9193K716904K354889j640168N52063J83792
3259.7G48451614j050262J84250J500015l179779j58005L66059k048951l01818O12564
3264.1G44375687R72900k394562j897125J686554J934357l90396N93185J997604n94635
3268.4G46283569j484680M090119j44959m179687k037735j670990l13492j189575K403564
3272.7G41756134M00009j298675K714691J14288k354126J081543N047989L59955m037857
$$ plain form
3277.1 743783951 745491333 747065201 742879410 742542572 744986267 743545609 745391159 745695572 743365097
3281.4 743365097 745798798 747205353 747089157 741432343 744891357 748586807 744487686 741438980
3285.3 741438980 744311142 748018570 747323532 748581467 749930954 749161224 742792435 737274475 740412216
3289.6 740412216 741377182 737698746 740119629 739804306 740076370 741165543 742171555 743113403 738638535
3294 738638535 739279175 739564362 740724792 739127731 739874725 742989502 743682022 745118103 747505798
3298.3 747505798 741506500 733334961 735136261 738322067 737442322 737979202 745350189 747703934 742048416
3302.6 742048416 741259842 739722214 734214020 731591721 731348953 737364960 740547867 739391556 740105972
3307 740105972 739497833 736776199 737434158 739476852 735749130 732708511 731097488 732030716 732046051
$$ packed form
3277.1G43783951J707382J573868m185791l36838K443695j440658J845550L04413k330475
3281.4G43365097K433701J406555j16196n656814L459014L695450m099121l048706
3285.3G41438980K872162L707428o95038J257935J349487p69730o368789n517960L137741
3289.6G40412216R64966l678436K420883l15323K72064J089173J006012R41848m474868
3294G38638535O40640K85187J160430j597061P46994L114777O92520J436081K387695
3298.3G47505798n999298q171539J801300L185806q79745N36880P370987K353745n655518
3302.6G42048416p88574j537628n508194k622299k42768O016007L182907j156311P14416
3307G40105972o08139k721634O57959K042694l727722l040619j611023R33228J5335
$$ plain form
3311.3 732046051 736368484 739044113 731775818 727174911 730929108 732033768 727329254 730233917
3315.2 730233917 732632523 728256760 727532806 727147751 726970596 728417740 728239670 724672089 725243149
3319.5 725243149 724523087 723812637 727595062 727107773 724978943 725865250 725361252 723937225 725187683
3323.9 725187683 726302872 725516052 725093536 725157013 723702011 722701111 722550735 725851746 725238571
3328.2 725238571 722362442 721599197 720341797 720281372 721385574 720983658 719558411 721605911 718694839
3332.5 718694839 718528748 719813843 722097473 722880859 720375748 717286987 718906479 722534790 725946426
3336.9 725946426 726338272 725498962 723714218 723106842 724369736 725792084 728052521 727753067 726666718
3341.2 726666718 728666916 729305496 731331177 733688583 732244720 730378418 732277832 730498352
$$ packed form
3311.3G32046051M322433K675629p268295m600907L754197J104660m704514K904663
3315.2G30233917K398606m375763p23954l85055j77155J447144j78070l567581N71060
3319.5G25243149p20062p10450L782425m87289k128830Q86307n03998j424027J250458
3323.9G25187683J115189p86820m22516O3477j455002j000900j50376L301011o13175
3328.2G25238571k876129p63245j257400o0425J104202m01916j425247K047500k911072
3332.5G18694839j66091J285095K283630P83386k505111l088761J619492L628311L411636
3336.9G25946426L91846q39310j784744o07376J262894J422348K260437k99454j086349
3341.2G26666718K000198O38580K025681K357406j443863j866302J899414j779480
$$ plain form
3345.1 730498352 732167282 732668152 729369278 726491318 729058914 731663513 730309906 727833710
3348.9 727833710 723492737 726164627 732654419 734724121 735288239 741402130 742693176 739198456
3352.8 739198456 736576309 733025818 732935562 734386139 737425690 737214508 737645340 738694153 736932526
3357.1 736932526 737785416 738581314 736206360 735673218 738915634 742174683 736845093 728870773 729545746
3361.5 729545746 734614105 735493698 733610306 735398712 740006714 740655899 739825058 737200623 735192947
3365.8 735192947 735119629 735786133 737665482 736372910 741112976 741057053 738469162 737119522 735907364
3370.2 735907364 736370392 738701935 734685135 735879211 740849304 739130402 740923920 742579880
3374 742579880 736686096 733307571 736121216 736451492 734601517 737908859 744536972 744791870 736750793
$$ packed form
3345.1G30498352J668930N00870l298874k877960K567596K604599j353607k476196
3348.9G27833710m340973K671890O489792K069702N64118O113891J291046l494720
3352.8G39198456k622147l550491r0256J450577L039551k11182M30832J048813j761627
3357.1G36932526Q52890P95898k374954n33142L242416L259049n329590p974320O74973
3361.5G29545746N068359Q79593j883392J788406M608002O49185q30841k624435k007676
3365.8G35192947p3318O66504J879349j292572M740066n5923k587891j349640j212158
3370.2G35907364M63028K331543m016800J194076M970093j718902J793518J655960
3374G42579880n893784l378525K813645L30276j849975L307342O628113K54898q041077
$$ plain form
3378.3 736750793 734485168 734214172 732540054 737718353 744495087 741833038 738151627 738237534 736362381
3382.7 736362381 735099716 735056992 739003983 741423874 738768082 738793945 741069489 741285324 741171494
3387 741171494 740990524 739608459 738312531 738105011 737439041 737812042 738468246 735689163 735336533
3391.4 735336533 738829727 736119308 739782639 744553604 737869034 731849594 730937576 729341431
3395.2 729341431 732295151 736670609 738068771 737896423 737295914 737689972 736240997 736396027 734430923
3399.6 734430923 733197556 738566895 737099152 732434921 737652588 738556366 735224686 735927811 735839005
3403.9 735839005 739794159 741472397 744224014 745553894 738888474 739433899 741144104 741401672 741673126
3408.2 741673126 741390533 738633652 734739990 732892303 731697006 737468109 740573578 739482346
$$ packed form
3378.3G36750793k265625k70996j674118N178299O776734k662049l681411Q5907j875153
3382.7G36362381j262665m2724L946991K419891k655792K5863K275544K15835j13830
3387G41171494j80970j382065j295928k07520o65970L73001O56204k779083l52630
3391.4G35336533L493194k710419L663331M770965o684570o019440r12018j596145
3395.2G29341431K953720M375458J398162j72348o00509L94058j448975J55030j965104
3399.6G34430923j233367N369339j467743m664231N217667R03778l331680P03125q8806
3403.9G35839005L955154J678238K751617J329880o665420N45425J710205K57568K71454
3408.2G41673126k82593k756881l893662j847687j195297N771103L105469j091232
$$ plain form
3412.1 739482346 738761444 740227890 741190872 737911758 736137924 738663559 735497055 734296875 737749939
3416.4 737749939 731376877 730259552 733778076 735686493 736032715 736323395 734906464 731168976 733438568
3420.8 733438568 735699844 732412338 734645691 738934326 737171173 731738892 734060211 738379288
3424.6 738379288 739063644 737190399 735765381 734070129 735498199 736853867 735687943 734493866
3428.5 734493866 736830139 737801895 738334351 738317566 736158524 734470215 733013992 736085358 736118164
3432.8 736118164 734770889 737721405 739627914 740394058 739171982 738611984 737322083 739363556 738625565
3437.2 738625565 735460968 735329895 736341095 736938171 736400833 731940536 731124954 734226303 734678040
3441.5 734678040 737320480 736801376 736200485 736102219 736905975 739642105 738113785 735016632 733042450
$$ packed form
3412.1G39482346p20902J466446R62982l279114j773834K525635l166504j200180L453064
3416.4G37749939o373062j117325L518524J908417L46222K90680j416931l737488K269592
3420.8G33438568K261276l287506K233353M288635j763153n432281K321319M319077
3424.6G38379288O84356j873245j425018j695252J428070J355668j165924j194077
3428.5G34493866K336273R71756N32456j6785k159042j688309j456223L071366L2806
3432.8G36118164j347275K950516J906509P66144j222076n59998j289901K041473p37991
3437.2G38625565l164597j31073J011200N97076n37338m460297q15582L101349M51737
3441.5G34678040K642440n19104o00891r8266Q03756K736130j528320l097153j974182
$$ plain form
3445.9 733042450 737571411 743188019 741744537 740718765 740906296 735733414 735694580 735027008 731142807
3450.2 731142807 732284775 734994354 733679352 738673096 745841370 740932999 736386032 738018036
3454.1 738018036 738209457 739087448 739326706 734980698 732661362 733670273 733363724 733093185 731213379
3458.4 731213379 733180847 738506851 734781342 734015045 734715805 736251602 736070328 733878860 734657898
3462.7 734657898 733929367 731052704 734652176 735547104 737620773 740231247 738016968 738736954 740313950
3467.1 740313950 739737091 737205048 735098495 730512314 731754379 739892807 741648483 742355347 738868256
3471.4 738868256 736147766 735982361 734690552 733478394 735938263 737947845 739345779 743412018
3475.3 743412018 746698837 744731216 739854736 737934341 741291428 738207855 732618256 736416016
$$ packed form
3445.9G33042450M528961N616608j443482j025772J87531n172882l8834o67572l884201
3450.2G31142807J141968K709579j315002M993744P168274m908371m546967J632004
3454.1G38018036J91421Q77991K39258m346008k319336J008911l06549k70539j879806
3458.4G31213379J967468N326004l725509p66297P00760J535797j81274k191468P79038
3462.7G34657898p28531k876663L599472Q94928K073669K610474k214279P19986J576996
3467.1G40313950n76859k532043k106553m586181J242065Q138428J755676P06864l487091
3471.4G38868256k720490j65405j291809j212158K459869K009582J397934M066239
3475.3G43412018L286819j967621m876480j920395L357087l083573n589599L797760
$$ plain form
3479.1 736416016 736480026 733400650 733699341 738211365 740926056 738547897 735293808 737411499 740113220
3483.5 740113220 739095078 738720093 736694031 735548019 738002701 737077637 728365021 728242416 733344040
3487.8 733344040 736845779 739596100 740279694 738427429 736590805 741015854 746280136 745366058 738786774
3492.1 738786774 737212372 734147110 734414825 737790985 737958832 740616302 744103317 742523651 733731766
3496.5 733731766 731912231 735790634 738831329 741309586 740940704 736722870 738122635 737859192 738636932
3500.8 738636932 737481155 738169403 739818497 739840317 738724213 738072815 734788132 736052933 740407639
3505.2 740407639 736893921 733570938 740913315 739105835 736509552 739110947 742443466 742887573
3509 742887573 741539078 736701660 733424377 737793884 744071884 744204407 744742889 743494873 737159576
$$ packed form
3479.1G36416016O4010l079376K98691M512024K714691k378159l254089K117691K701721
3483.5G40113220j018142l74985k026062j146012K454682r25064q712616j22605N101624
3487.8G33344040L501739K750321O83594j852265j836624M425049N264282r14078o579284
3492.1G38786774j574402l065262K67715L376160J67847K657470L487015j579666q791885
3496.5G33731766j819535L878403L040695K478257l68882m217834J399765k63443P77740
3500.8G38636932j155777O88248J649094K1820j116104o51398l284683J264801M354706
3505.2G40407639l513718l322983P342377j807480k596283K601395L332519M44107
3509G42887573j348495m837418l277283M369507O278000J32523N38482j248016o335297
$$ plain form
3513.4 737159576 738959961 741856079 737714844 737010956 741478424 741661835 739327850 740588608 738520813
3517.7 738520813 736629410 738670425 740472870 740555038 738697205 738484726 742688065 742175827 742107773
3522 742107773 741376419 740041275 742516098 744267044 741789017 743847961 743693161 738883057 737369843
3526.4 737369843 742238312 741475601 737436371 742371597 750224228 750617294 748539963 743290176 739096222
3530.7 739096222 742385483 750631714 751641388 746642151 741393814 740087662 743967285 747850723
3534.6 747850723 746418991 743497086 741052628 743109283 745298615 748664703 748329926 742924881
3538.4 742924881 741878738 744787903 745781479 741793747 742596207 746323090 747266235 741716385 737426758
3542.8 737426758 741113968 743391571 746621017 748580093 749808960 751355133 751585770 748912048
$$ packed form
3513.4G37159576J800385K896118m141235p03888M467468J83411k333985J260758k067795
3517.7G38520813j891403K041015J802445Q2168j857833k12479M203339n12238o8054
3522G42107773p31354j335144K474823J750946k478027K058944j54800m810104j513214
3526.4G37369843M868469p62711m039230M935226P852631L93066k077331n249787m193954
3530.7G39096222L289261Q246231J009674m999237n248337j306152L879623L883438
3534.6G47850723j431732k921905k444458K056655K189332L366088l34777n405045
3538.4G42924881j046143K909165R93576l987732Q02460L726883R43145n549850m289627
3542.8G37426758L687210K277603L229446J959076J228867J546173K30637k673722
$$ plain form
3546.6 748912048 746711807 744869232 742896423 745860977 747884750 750685883 754677353 755094833
3550.5 755094833 756155319 752121201 749298782 752891617 755698242 750206146 746311951 745040741
3554.4 745040741 745431824 747575150 750594635 749590302 747994003 752552567 758588943 760012589
3558.2 760012589 758247299 756687393 753241806 751648483 753499146 748643875 748345108 754282303
3562.1 754282303 757165909 754560242 755562210 754432068 755125580 759922256 766143875 762715912
3565.9 762715912 755489273 754448395 758463211 754367752 751673355 760241776 761010666 765065536
3569.8 765065536 766877060 760349350 756705170 758137131 759953079 761076736 762374573 763135452
3573.6 763135452 765858307 766210175 761373978 755890579 754849091 756573639 761043320 764310379
$$ packed form
3546.6G48912048k200241j842575j972809K964554K023773K801133L991470M17480
3550.5G55094833J060486m034118k822419L592835K806625n492096l894195j271210
3554.4G45040741L91083K143326L019485j004333j596299M558564O036376J423646
3558.2G60012589j765290j559906l445587j593323J850663m855271k98767N937195
3562.1G54282303K883606k605667J001968j130142O93512M796676O221619l427963
3565.9G62715912p226639j040878M014816m095459k694397Q568421P68890M054870
3569.8G65065536J811524o527710l644180J431961J815948J123657J297837P60879
3573.6G63135452K722855L51868m836197n483399j041488J724548M469681L267059
$$ plain form
3577.5 764310379 762080765 761038284 759179535 756074448 756185150 758739777 758643723 762365112 762509003
3581.8 762509003 758517303 756598206 755533524 753680725 760205383 763369370 756911316 760869675
3585.7 760869675 762820663 757552338 757687225 758215942 756503448 757481613 760408554 764668961 762039948
3590 762039948 762172012 761100616 760037537 766487579 767105942 765141907 764017181 759986038 763747559
3594.4 763747559 764210129 757463989 760610962 767150726 764600677 759459763 762926865 764954071
3598.2 764954071 766796265 765389252 759963913 759382477 761443176 761783524 769636765 770756989 769142456
3602.6 769142456 765984650 760650177 763748856 763684921 758301086 760788727 765359802 765414047 764669342
3606.9 764669342 762204666 769259491 773328705 768330154 763298950 763376083 761779556 763876953 766266098
$$ packed form
3577.5G64310379k229614j042481j858749l105087J10702K554627r6054L721389J43891
3581.8G62509003l991700j919097j064682j852799O524658L163987o458054L958359
3585.7G60869675J950988n268325J34887N28717j712494R78165K926941M260407k629013
3590G62039948J32064j071396j063079O450042O18363j964035j124726m031143L761521
3594.4G63747559M62570o746140L146973O539764k550049n140914L467102K027206
3598.2G64954071J842194j407013n425339n81436K060699L40348P853241J120224j614533
3602.6G69142456l157806n334473L098679o3935n383835K487641M571075N4245p44705
3606.9G64669342k464676P054825M069214m998551n031204P7133j596527K097397K389145
$$ plain form
3611.3 766266098 765697937 762783051 757334747 762335892 767724152 768547134 769082642 770830154 765165482
3615.6 765165482 763236237 771267090 771335220 765665894 768993988 775686722 772871780 762962952 767222595
3619.9 767222595 772285614 769505844 768243179 767107697 771245270 770654907 767833557 767723236 769186325
3624.3 769186325 773263626 766990433 762151947 761791229 767459412 773161316 769814529 766225510
3628.1 766225510 768403549 772011948 760963211 766462097 777293930 768135300 759823837 764242401
3632 764242401 767916183 764569244 760407639 761972122 764828339 763964767 765053711 766830444 766268005
3636.3 766268005 764064102 759144058 756995468 763437653 767722168 768627548 767141113 763819122
3640.2 763819122 762921600 768999863 768219070 768212204 771946411 774686432 773179626 767898788 766444626
$$ packed form
3611.3G66266098n68161k914886n448304N001145N388260Q22982N35508J747512n664672
3615.6G65165482j929245Q030853O8130n669326L328094O692734k814942r908828M259643
3619.9G67222595N063019k779770j262665j135482M137573n90363k821350j10321J463089
3624.3G69186325M077301o273193m838486l60718N668183N701904l346787l589019
3628.1G66225510K178039L608399j1048737N498886J0831833r158630q311463M418564
3632G64242401L673782l346939m161605J564483K856217q63572J088944J776733n62439
3636.3G66268005k203903m920044k148590O442185M284515R05380j486435l321991
3640.2G63819122q97522O078263p80793o866L734207K740021j506806n280838j454162
$$ plain form
3644.5 766444626 768580627 771034775 773595581 774925919 774848022 770360947 770313873 771307449 768355713
3648.9 768355713 765462799 771830750 769207077 763326187 762489471 766587677 769166565 766426392
3652.7 766426392 766431427 767452011 766451416 763959427 766188202 766595001 760705566 759644394 766385880
3657.1 766385880 770584564 769638748 766541138 765705719 767517242 769423294 767663574 771532745 772091980
3661.4 772091980 767881927 769050446 770689926 770669556 769454346 767910995 766759872 764018707 762967834
3665.7 762967834 764792786 767053757 769978867 775360260 776067123 768521194 768310928 775386658 774489594
3670.1 774489594 764675827 763326569 774469528 777921143 773299561 772870331 775097275 775608139
3673.9 775608139 772868423 771852722 780133286 774633408 765499268 775674057 777262192 776405563
$$ packed form
3644.5G66444626K136001K454148K560806J330338p7897m487075m7074R93576k951736
3648.9G68355713k892914O367951k623673n880890q36716M098206K578888k740173
3652.7G66426392N035J020584j000595k491989K228775M06799n889435j061172O741486
3657.1G66385880M198684r45816l097610q35419J811523J906052j759720L869171N59235
3661.4G72091980m210053J168519J639480k0370j215210j543351j151123k741165j050873
3665.7G62967834J824952K260971K925110N381393P06863p545929k10266P075730q97064
3670.1G74489594r813767j349258J1142959L451615m621582m29230K226944N10864
3673.9G75608139k739716j015701Q280564n499878r134140J0174789J588135q56629
$$ plain form
3677.8 776405563 773284302 771551437 766411819 766438293 774744034 774695740 773888702 772893600 771583405
3682.1 771583405 776526413 780345535 775653458 776958008 780490646 778609772 774414215 775821075
3686 775821075 779074173 775058517 772968750 777762222 770836029 772305298 782855377 778980026
3689.9 778980026 772170410 764671860 761744766 771973572 776875458 773271103 777436600 780104141
3693.7 780104141 777666397 773213043 770882874 774548721 778043900 774662247 770273590 771031036
3697.6 771031036 776871948 783097687 788159256 784305420 778564606 776007156 776271515 779888611
3701.4 779888611 779466019 776966248 779918213 777566528 779299316 782817154 780299149 777535706
3705.3 777535706 780255432 779617233 775921783 777742233 777683258 780573730 778331223 771771622 771790924
$$ packed form
3677.8G76405563l121261j732865n139618K6474Q305741m8294q07038r95102j310195
3682.1G71583405M943008L819122m692077J304550L532638j880874m195557J406860
3686G75821075L253098m015656k089767M793472o926193J469269J0550079l875351
3689.9G78980026o809616p498550k927094J0228806M901886l604355M165497K667541
3693.7G80104141k437744m453354k330169L665847L495179l381653m388657P57446
3697.6G71031036N840912O225739N061569l853836n740814k557450K64359L617096
3701.4G79888611m22592k499771K951965k351685J732788L517838k518005k763443
3705.3G77535706K719726o38199l695450J820450n8975K890472k242507o559601J9302
$$ plain form
3709.6 771790924 782606277 784060516 783369675 788330307 779124222 775282516 779770813 780729752
3713.5 780729752 780348816 776422119 774122162 776646500 779277496 777920227 772138290 772607803 777046280
3717.8 777046280 780787430 783919067 779811859 777365036 780338821 779082870 778883362 779789581 778579407
3722.2 778579407 782106323 784133072 781758270 783525925 786651230 783933868 784438477 787050705
3726 787050705 779332352 777567749 786048508 785671387 780440140 779242477 778705521 780028381 778481903
3730.4 778481903 778135681 777796173 771483765 766567993 777409058 783336639 787302856 792978516
3734.2 792978516 777620163 770852661 781488419 785112839 781669617 779048920 782679977 784307861
3738.1 784307861 780963364 781294937 794147263 791968536 776984406 777622833 780141449 778919830
$$ packed form
3709.6G71790924J0815353J454239o90841M960632r206085l841706M488297R58939
3713.5G80729752l80936l926697k299957K524338K630996j357269n781937M69513M438477
3717.8G77046280L741150L131637m107208k446823K973785j255951j99508R06219j210174
3722.2G78579407L526916K026749k374802J767655L125305k717362N04609K612228
3726G87050705p718353j764603Q480759l77121n231247j197663n36956J322860j546478
3730.4G78481903l46222l39508o312408m915772J0841065N927581L966217N675660
3734.2G92978516j5358353o767502J0635758L624420l443222k620697L631057J627884
3738.1G84307861l344497L31573J2852326k178727j4984130O38427K518616j221619
$$ plain form
3741.9 778919830 780315018 780128479 783190994 785075607 774574738 759258957 770276337 783607559
3745.8 783607559 787638931 784896469 776034698 777226639 780350876 784042816 772689667 753212128
3749.6 753212128 775765076 792304382 792559433 779381943 772736206 780979691 783689041 781915283
3753.5 781915283 775197220 773804703 776456985 782274246 788465347 783285217 772003326 770986481
3757.4 770986481 773312302 773016663 776834564 776697998 766229553 763434830 773221130 780223007
3761.2 780223007 779890671 778254776 775881271 773271255 775035629 777107010 780582581 780617752 775203552
3765.6 775203552 774844818 780538025 784097977 780221481 776890259 781163483 789268799 789512634 780943298
3769.9 780943298 776614227 775427551 775028305 776881332 774362183 773363037 776038513 778470612 779408188
$$ packed form
3741.9G78919830J395188j86539L062515J884613j0500869j5315781J1017380J3331222
3745.8G83607559M031372k742462q861771J191941L124237L691940j1353149j9477539
3749.6G53212128K2552948J6539306K55051j3177490o645737Q243485K709350j773758
3753.5G81915283o718063j392517K652282N817261O191101n180130j1281891j016845
3757.4G70986481K325821k95639L817901j36566j0468445k794723R786300P001877
3761.2G80223007l32336j635895k373505k610016J764374K071381L475571L5171n414200
3765.6G75203552l58734N693207L559952l876496l331222M273224Q105316K43835q569336
3769.9G80943298m329071j186676l99246J853027k519149r99146K675476K432099R37576
$$ plain form
3774.2 779408188 779965591 778643112 776215210 773283157 770577164 770055389 772578888 774347610 774645386
3778.6 774645386 773355179 770275116 772747498 776782379 777353058 772431946 774570389 781988907
3782.4 781988907 778650208 774006653 776074600 769666748 762464905 764668503 769757385 769331741
3786.3 769331741 770982513 775227203 774836273 774888763 774984894 769569321 765312576 771785202 778926086
3790.6 778926086 776230927 773304977 772657852 771260757 772589264 774032669 775505753 774034500
3794.5 774034500 771885147 772329254 771093521 769918900 772853699 776554108 773095856 770804138
3798.4 770804138 766977692 765933228 769865723 777982407 784163666 778796768 766331482 765773773
3802.2 765773773 774359741 781164322 783838882 782707748 778172760 774264679 777291412 780874329
$$ packed form
3774.2G79408188N57403j322479k427902k932053k705993n21775K523499J768722K97776
3778.6G74645386j290207l080063K472382M034881N70679m921112K138443P418518
3782.4G81988907l338699m643555K067947o407852p201843K203598N088882m25644
3786.3G69331741J650772M244690l90930N2490R6131n415573m256745O472626P140884
3790.6G78926086k695159k925950o47125j397095J328507J443405J473084j471253
3794.5G74034500k149353M44107j235733j174621K934799L700409l458252k291718
3798.4G70804138l826446j044464L932495Q116684O181259n366898j2465286n57709
3802.2G65773773Q585968O804581K674560j131134m534988l908081L026733L582917
$$ plain form
3806.1 780874329 774836502 768713531 771431961 778072891 781868515 781122589 773925705 770422440
3809.9 770422440 776255798 783804474 779143372 771640015 763831940 762697372 766475372 770997009
3813.8 770997009 771928482 774191971 777200546 770946350 764769669 767660675 775530624 776191711 770598068
3818.1 770598068 769663620 771481857 774075012 775590286 774560165 773342667 778083420 777400513 779892044
3822.5 779892044 778977203 783138962 781490173 773918991 774898834 780802689 780102386 775850601 769710464
3826.8 769710464 768653564 767362366 767151566 770291138 773123245 773183899 766165466 769201508 775356674
3831.1 775356674 776492462 781938400 776670837 769044876 766520157 767849045 769195557 769143753 769108047
3835.5 769108047 773447418 776774979 781178818 780676422 772758331 777008133 782035217 779600906
$$ packed form
3806.1G80874329o037827o122971K718430O640930L795624p45926p196884l503265
3809.9G70422440N833358P548676m661102p503357p808075j134568L778000M521637
3813.8G70997009R31473K263489L008575o254196o176681K891006P869949O61087n593643
3818.1G70598068r34448J818237K593155J515274j030121j217498M740753o82907K491531
3822.5G79892044r14841M161759j648789p571182R79843N903855p00303m251785o140137
3826.8G69710464j056900j291198k10800L139572K832107O0654p018433L036042O155166
3831.1G75356674J135788N445938n267563p625961k524719J328888J346512n1804l5706
3835.5G69108047M339371L327561M403839n02396p918091M249802N027084k434311
$$ plain form
3839.3 779600906 778567047 774471436 768420715 770829697 777340546 778699722 775010147 770534210
3843.2 770534210 768587570 768902969 773810272 776141129 773252411 771202545 773636551 775177841
3847.1 775177841 772701035 775181122 782070465 783018112 774927902 766751251 765111618 767759705
3850.9 767759705 771640854 769496689 759208527 771556702 778418961 763295670 745996475 763882217
3854.8 763882217 779567871 777329330 769344864 770165558 773262787 776454544 781007614 779456635
3858.6 779456635 776259613 774107666 774834442 774127731 772224121 765901718 771505280 777424393 775547180
3863 775547180 773533859 774179687 771556244 770668259 775065613 774177246 773155594 772826920 771999512
3867.3 771999512 773624344 772871323 771734543 779706039 781142731 772974548 775718918 779734573
$$ packed form
3839.3G79600906j033859m095611o050721K408982O510849J359176l689575m475937
3843.2G70534210j946640L15399M907303K330857k888718k049866K434006J541290
3847.1G75177841k476806K480087O889343R47647q090210q176651j639633K648087
3850.9G67759705L881149k144165j0288162J2348175O862259j5123291j7299195J7885742
3854.8G63882217J5685654k238541p984466Q20694L097229L191757M553070j550979
3858.6G79456635l197022k151947P26776p06711j903610o322403N603562N919113j877213
3863G75547180k013321O45828k623443q87985M397354q88367j021652l28674q27408
3867.3G71999512J624832p53021j136780P971496J436692q168183K744370M015655
$$ plain form
3871.2 779734573 773345490 773952713 775820770 773469009 774021988 772837372 773051605 775257416 769679718
3875.5 769679718 770345612 775770798 776808014 775874100 774169159 773822861 769206390 772577515 777131653
3879.8 777131653 774300613 769303284 769814224 776634445 779413452 774174728 771734085 770628815
3883.7 770628815 769370422 775687256 770890045 761589203 769144287 778324814 778581696 779889603
3887.6 779889603 775868454 768139648 769897537 776478500 776940994 780336838 777538452 769393616
3891.4 769393616 764777222 767621689 770046844 769314880 773611984 775023651 775162430 773842926 773696518
3895.8 773696518 775814362 776775284 776343613 774635849 770788956 770674896 773063507 771196823 783637161
3900.1 783637161 785380783 776221313 768926468 766410980 772419281 777774887 776661072 772206573
$$ packed form
3871.2G79734573o389083O07223J868057k351761N52979j184616K14233K205811n577698
3875.5G69679718O65894N425186J037216r33914j704941l46298m616471L371125M554138
3879.8G77131653k831040m997329N10940O820221K779007n238724k440643j105270
3883.7G70628815j258393O316834m797211r300842P555084R180527K56882J307907
3887.6G79889603m021149p728806J757889O580963M62494L395844k798386q144836
3891.4G69393616m616394K844467K425155p31964M297104J411667J38779j319504j46408
3895.8G73696518K117844R60922m31671j707764l846893j14060K388611j866684J2440338
3900.1G83637161J743622r159470p294845k515488O008301N355606j113815m454499
$$ plain form
3904 772206573 766557770 774804535 775955200 769249496 770173874 774544144 777951584 775809479 770049667
3908.3 770049667 772382507 768265915 764696655 773070679 777362671 770077057 766983185 770261154
3912.2 770261154 769602661 767802429 770354538 774538116 773291397 769356995 770043106 773162537 774768982
3916.5 774768982 771519775 766011353 773845215 779231339 775541153 773277283 769275284 765810471
3920.4 765810471 768402100 768239441 765578613 762848587 763826752 769633484 774299316 776122208 775363464
3924.7 775363464 774197845 772506332 770057449 768194046 765454407 765482788 772130432 772420654 771445847
3929 771445847 767213821 764581985 766752930 772665558 776177826 773995132 770362930 770103226 772134323
3933.4 772134323 768287277 769626389 777030487 778529510 776012726 775830765 773819656 768620529
$$ packed form
3904G72206573n648803Q246765J150665o705704R24378M370270L407440k142105n759812
3908.3G70049667K332840m116592l569260Q374024M291992p285614l093872L277969
3912.2G70261154o58493j800232K552109M183578j246719l934402O86111L119431J606445
3916.5G74768982l249207n508422P833862N386124l690186k263870m001999l464813
3920.4G65810471K591629j62659k660828k730026R78165N806732M665832J822892p58744
3924.7G75363464j165619j691513k448883j863403k739639K8381O647644K90222r74807
3929G71445847m232026k631836K170945N912628L512268k182694l632202k59704K031097
3933.4G72134323l847046J339112P404098J499023k516784j81961k011109n199127
$$ plain form
3937.2 768620529 775856705 773789520 764935989 765835876 770209808 772937775 774765701 768244629
3941.1 768244629 766292496 769262772 768275375 769597702 775417709 778634109 777359924 770025711
3944.9 770025711 766994553 770000610 771945953 776236267 776639709 768603516 762539139 763959503
3948.8 763959503 767676620 768733978 770252991 773441315 769643478 768749161 771180496 771045227 772580032
3953.1 772580032 773619537 770713120 769437408 770280609 768603668 771629333 770283966 764753799
3957 764753799 764308014 766511078 770387497 772133713 767580719 765260315 768049698 773196259 771493988
3961.3 771493988 769613037 771264725 776164398 775598755 772984772 771600113 768836975 764507141
3965.2 764507141 766198883 768899765 772198181 772270737 767143478 765224228 763934479 768140488 771459579
$$ packed form
3937.2G68620529P236176k067185q853531Q99887M373932K727967J827926o521072
3941.1G68244629j952133K970276r87397J322327N820007L216400j274185p334213
3944.9G70025711l031158L006057J945343M290314M03442q036193o064377J420364
3948.8G63959503L717117J057358J519013L188324l797837q94317K431335j35269J534805
3953.1G72580032J039505k906417j275712Q43201j676941L025665j345367n530167
3957G64753799m45785K203064L876419J746216m552994k320404K789383N146561j702271
3961.3G71493988j880951J651688M899673n65643k613983j384659k763138m329834
3965.2G64507141J691742K700882L298416P2556n127259j919250j289749M206009L319091
$$ plain form
3969.5 771459579 771153793 772751923 776281052 781775055 779112244 771364594 769218597 769341202 768021393
3973.9 768021393 770894699 776247253 771366425 765927582 763436813 766387711 773303528 774417953
3977.7 774417953 772157135 769709015 768682556 768513336 772096176 774165497 767257919 761841583
3981.6 761841583 763736877 767300034 768575897 770007248 772447052 777453156 776782990 767542877
3985.4 767542877 767470703 769500504 768427963 769382172 773972855 771974869 768160553 766941833 772904663
3989.8 772904663 773506241 769049759 767651062 772130356 774700165 772593918 767305222 770822220
3993.6 770822220 767110748 766696320 770349350 770674057 773769760 775256653 773342819 769874039 764760895
3998 764760895 765543671 773593292 769926453 765925903 771359329
$$ packed form
3969.5G71459579l05786J598130L529129N494003k662811p747650k145997J22605j319809
3973.9G68021393K873306N352554m880828n438843k490769K950898O915817J114425
3977.7G74417953k260818k448120j026459j69220L582840K069321o907578n416336
3981.6G61841583J895294L563157J275863J431351K439804N006104o70166r240113
3985.4G67542877p2174K029801j072541R54209M590683j997986l814316j218720N962830
3989.8G72904663O01578m456482j398697M479294K569809k106247n288696L516998
3993.6G70822220l711472m14428L653030L24707L095703J486893j913834l468780n113144
3998G64760895P82776Q049621l666839m000550N433426
$$ plain form
4000.4 771359329
$$ packed form
4000.4G71359329
##END=$$ End of the data block
