##TITLE=$$ Begin of the data block
##JCAMP-DX=5.00 $$ ACD/SpecManager v 12.01
##DATE=20 Mar 2009 10:21:02
##DATA TYPE=INFRARED SPECTRUM
##DATA CLASS=XYDATA
##ORIGIN=
##OWNER=
##NPOINTS=7053
##FIRSTX=599.86669922
##LASTX=4000.39697266
##MAXX=4000.39697266
##MINX=599.86669922
##MAXY=95.13588715
##MINY=28.34717751
##XFACTOR=1.0000000000
##YFACTOR=0.000000100000000
##FIRSTY=50.97997665
##DELTAX=0.48220792
##XUNITS=1/CM
##YUNITS=TRANSMITTANCE
##XYDATA=(X++(Y..Y))
599.9 509799767 502434196 506474495 516513329 506149940 503864822 509372368 516865425 526620712
603.7 526620712 531347885 525291328 527841911 538105507 533034554 540530586 553924637 565986671
607.6 565986671 558456230 543859406 542830582 539039001 546036758 552407761 558691368 564293175
611.4 564293175 569379654 563414192 557095528 568494835 575168228 571626129 575373459 579339027
615.3 579339027 587772255 601344719 608182030 612422676 610654831 608390083 604919815 599314880
619.2 599314880 609514084 620954323 615125046 612483826 613770828 616735764 618800278 622673302
623 622673302 627085991 627430458 630702171 634800377 631500702 624984665 627425423 631894531 639994469
627.4 639994469 653648071 661428986 660407028 657433777 657501602 654477539 659728088 665864410 669280167
631.7 669280167 675292435 681066437 690377731 689024963 681538696 677816391 679249725 686322937
635.6 686322937 685429306 681565857 680251999 687876205 684400406 674119110 680629196 691847992
639.4 691847992 687984390 685703430 690609894 702942352 706272354 709178696 719673004 713940582
643.3 713940582 711138458 713643723 707619934 715143890 726245117 726321106 732360229 742980728
647.1 742980728 744018784 734601974 740723724 746183319 740814896 745147705 745149612 741285400 749861298
651.5 749861298 757365723 759840240 762278519 762757034 763300171 762036057 761536865 763305054 767024841
655.8 767024841 771361160 772838516 775091553 774579010 767373047 761022034 765086975 774035873 773983536
660.1 773983536 770675659 766269684 768616028 777836685 782265778 787744217 790253677 785873795
664 785873795 780156937 778059998 783517456 790717316 796847305 808134155 823996048 856641769
667.9 856641769 849535217 820985031 812498627 809190063 804008789 806053314 806102142 802431717 812324295
672.2 812324295 823405762 815228424 808345413 810324326 820850906 826698303 826797028 824046249
676.1 824046249 827176819 827963333 825703812 819347534 817444305 820771790 826183243 838164139
679.9 838164139 840435104 836592102 832992249 833382034 836684494 834257431 833738480 845914383 843473511
684.3 843473511 838801346 851103745 846026077 835884705 834510193 840528488 841524582 845996704
688.1 845996704 850088196 847562256 842975998 841455231 841449890 837604370 837082977 847802811 852204361
692.5 852204361 843718185 845052719 852095413 856111679 860624237 861744080 857966766 851371231
696.3 851371231 845225601 845284500 855788269 866609879 867196732 865231552 870147476 870534897 861778641
700.6 861778641 857969437 862657700 867094574 859981766 858537140 863546448 866290817 865067825
704.5 865067825 864987793 864554214 865040665 868008194 866848373 868212891 867914734 869263000 874249649
708.8 874249649 864688568 860317154 870329285 872929382 873314819 875710144 875896454 872750320 872745438
713.2 872745438 881788712 885515518 878425827 878998871 881784286 878572311 878688126 876802902 877156448
717.5 877156448 881169891 886380692 883239822 880157242 882293320 885525742 885580368 885171356 884500046
721.9 884500046 885344391 890935669 890327606 887996597 885346909 885171661 888843613 893236618 895105972
726.2 895105972 892911606 896817932 892838135 888113403 891835709 895375214 889265366 885672684
730.1 885672684 887118225 890658264 895760345 896324615 894753799 896414642 896042099 895971298 895841904
734.4 895841904 898530731 902305603 902079086 900035400 899821167 897351456 891979980 895316544 902015228
738.7 902015228 905641479 903678970 895706406 886858063 891846771 897121964 899202347 900652466
742.6 900652466 907158890 915701599 917612305 910773087 909808121 911178360 906920853 899291763 898576508
746.9 898576508 904171524 903806534 902461166 910082855 906585236 902965927 903563232 906310425 905326462
751.3 905326462 896002731 897673569 895300674 890110016 881852722 881461182 883906174 881182098 883884277
755.6 883884277 886449356 878836441 872279358 867248306 865136032 871917191 874365768 875382462
759.5 875382462 873978424 868378296 872735748 872175903 877984772 885132217 887845230 894213181 893267746
763.8 893267746 889184647 896462173 912230530 915696259 912640991 909376755 908683243 906725388
767.7 906725388 905251541 908362885 910438614 907371521 905792160 908319321 918175812 917916718 910553665
772 910553665 906993179 910447617 914413147 912371521 908946762 906215363 905361023 907846985 908942871
776.4 908942871 908561096 907863235 908137207 913515396 915413055 912404099 913364334 905671768 899121017
780.7 899121017 895493698 892632599 898685989 895395203 888918304 886031876 876650772 868439865
784.6 868439865 860406876 853934708 845232544 833041229 820879974 809752274 793119278 779632645
788.4 779632645 781042404 791453629 809919662 816576843 812191544 818365784 823520203 819648437
792.3 819648437 807286148 792293091 776784973 756391754 737500534 717960892 699608765
795.6 699608765 681398849 664712906 666529541 674397964 675266876 676797180 688924637 700376663
799.5 700376663 707148132 713270111 725522690 742704773 754977722 764600143 771918716 786209793
803.4 786209793 799276276 801980667 811523743 824061966 828986206 836159973 851375198 862779999
807.2 862779999 867667999 869816055 877181320 882975006 880027008 878172302 887096176 897808914
811.1 897808914 902182693 906052704 905174408 902841949 904366760 906557159 904844894 899250336 898661423
815.4 898661423 898683243 902716446 910384827 909524612 907285004 908718262 909169846 909139023 912266541
819.8 912266541 914639511 916108093 910662537 911284027 912583847 918956070 929220123 935733185
823.6 935733185 928228836 920167160 917815094 919554214 926164932 926546707 921940994 921220016 924456024
828 924456024 928387833 928137894 921114273 916979370 916973724 916029892 921520920 923021545 923099060 928774185
832.8 928774185 926100311 923191681 925414047 918304749 919020386 920047073 919915848 927363510 929319382
837.1 929319382 928180161 925826874 918411560 920552673 925761261 922060471 910097122 913621292
841 913621292 925682907 926171646 923730774 923362961 925041199 917659302 918434982 920874634 919150314
845.3 919150314 925400085 930703354 932432709 930919113 925326385 926438675 930092316 926762772
849.2 926762772 929648056 931392899 927401276 916852493 915982132 919609985 916633148 913924408
853 913924408 915457535 917211151 909441757 908725204 919249649 916315994 911425858 916061478 913765945
857.4 913765945 911272736 915871353 913958969 908964920 906456070 909839935 914493866 911774521
861.2 911774521 909841003 909170456 903641663 898876190 901494370 902897339 902274780 901138306 895735016
865.6 895735016 899886169 903487015 902087173 899698868 898758545 902970886 892790985 883844910
869.4 883844910 883281250 884075089 881139374 875599213 869650269 864335632 860686417 860430832 856557693
873.8 856557693 848141556 843422470 832716446 810269165 792405396 795911407 791951370 774377670
877.6 774377670 757514038 740979767 727220917 705538330 680243301 661393814 637132187
881 637132187 606135406 574686089 539825859 500468941 472935448 446822968 417868958 392677155
884.9 392677155 372754059 361813164 350258865 336816711 336789207 339615211 343789978 355677147
888.7 355677147 370221596 386394196 407536316 428740540 455428352 476084633 494590988
892.1 494590988 521328850 553708420 579829750 600664253 625055923 650151443 675679016
895.5 675679016 691180725 711774597 731074753 748329010 767325287 780456848 786996536 795555191
899.3 795555191 802469559 810530624 826843491 837609787 844964828 842610245 837355881 840848846
903.2 840848846 847189484 850299759 856182022 860124054 855756912 856176453 857268753 859371948 862293167
907.5 862293167 855364151 846155014 845121994 844391785 837756195 824865265 808741531 796079330
911.4 796079330 780198517 762371445 742759323 720864334 705404663 702509003 709982147 730251617
915.2 730251617 753494339 769217758 785828552 803498077 816259003 820419159 825412674 832096329
919.1 832096329 837328186 844867859 854201202 865381393 878103714 881169586 882040329 881928177
922.9 881928177 881348572 888987656 893067322 895076218 898862762 899092331 900507278 900315170 901213226
927.3 901213226 902580414 902662354 909768677 913396835 909847183 908999176 906140137 908110886 911678925
931.6 911678925 909863739 906292343 910254822 908574295 903975372 907166519 911131668 908965988
935.5 908965988 908679886 906613998 905831223 907112808 906031265 907398682 908884354 906627045 909232407
939.8 909232407 913131104 913837662 907666855 909500809 914476395 913809586 908735962 911215820 912439957
944.2 912439957 907607727 905920792 904674606 909305191 920716324 918754654 910149307 909040375
948 909040375 909293976 904810562 907659760 909550095 904493179 898593979 899515076 903957520 901856842
952.4 901856842 889988251 882562866 881100388 879504700 871448822 865102997 863501968 860639343
956.2 860639343 859870453 858019638 859677505 862225189 868603439 878337021 882333603 887141571 891927414
960.6 891927414 893390350 898001175 901454163 900649796 903743744 904638596 901239853 900707169 901840363
964.9 901840363 902108307 904246140 904454193 905478210 907545624 907683258 912561493 916510696 914668503
969.2 914668503 912017136 909792252 907769852 909109116 914989853 913852539 909366226 902514038
973.1 902514038 901471634 906150436 906351852 908419266 911437912 905586319 904051819 905279846 905745010
977.4 905745010 906384430 904327774 901226883 896471558 895686874 894548416 893650894 892338715 885871811
981.8 885871811 884540787 886651688 885908279 881031342 880654831 883117294 879270172 875134354 876050644
986.1 876050644 879420242 880526505 878402252 877272797 878363266 877848740 875933304 877874985 881232529
990.5 881232529 881130295 880602493 882852325 880199127 881346741 881073914 880148621 882515869 879822769
994.8 879822769 875652847 877337646 879793167 879792633 882244415 880484085 878600235 880441818 879720459
999.1 879720459 878443069 876195984 878153152 879801178 881289825 883276367 882053146 881707764 880371628
1003.5 880371628 877165070 878458328 875719299 873162308 874354706 869934006 868689270 868793945
1007.3 868793945 857979431 849693375 849044724 848026733 844920197 842442017 841563187 840492249
1011.2 840492249 834175644 831338196 828574829 824583817 824372940 821376495 819298096 818305283 815553513
1015.5 815553513 816180954 814588852 813133011 812203369 813031082 816156311 821622696 823209991 822936707
1019.9 822936707 817619781 816485596 817645721 816667175 820567856 823426132 823205795 824811172 824902802
1024.2 824902802 827025299 833956833 839078751 840890198 843940735 846648941 848512344 853138123
1028.1 853138123 854866867 859359436 856326981 856724167 862235260 862960815 862941818 865694199 866776810
1032.4 866776810 866155319 865143127 861193085 859374695 864103088 867990875 864436035 858876648
1036.3 858876648 854908905 854239044 854094772 853566895 853088837 855703125 856051941 856550598 853642120
1040.6 853642120 850277023 851183395 851631393 850734100 849507065 842904739 843146973 846822433 846271515
1044.9 846271515 841525497 841958237 844658585 837558823 827294540 822437744 822087173 817481689
1048.8 817481689 808380737 799070129 794022980 796183167 798441849 799438400 796090393 795521088 800197754
1053.1 800197754 805439148 814482574 826099167 832989731 830811920 833373032 841552887 846687469
1057 846687469 848222122 847370529 852529068 858864670 858459549 854040070 858785095 864488144 864617615
1061.3 864617615 862620010 866411972 871935120 870183716 863539429 863554382 864422455 866398315 868691788
1065.7 868691788 870490875 870560226 872409515 874405365 876325684 876449203 872401352 868214645 870767670
1070 870767670 872467499 866615753 865067520 870081558 872018661 871395721 872201843 869557114 862467117
1074.4 862467117 866129456 870911102 870892029 868482285 864558182 864889374 864762192 860711212 865540848
1078.7 865540848 872674866 873620605 870155182 865156250 863320618 868564529 871157303 871817780 880488892
1083 880488892 883050537 877130966 874192734 875296860 879927216 884720154 883987122 880583954 880418243
1087.4 880418243 881503906 883106842 880359955 880465622 883109894 883828430 884474487 883045197 881828613
1091.7 881828613 885044785 888882523 885994873 881170044 883688126 886202621 884220428 880297470
1095.6 880297470 880033493 881587296 881330566 881383743 880806122 883054886 883948517 881560669 878629913
1099.9 878629913 875326996 874884720 876992187 876814651 874440994 873107452 872997513 869899826 866207809
1104.3 866207809 866942749 867688065 867146454 867963181 870312576 870381088 869144592 869627533 868535843
1108.6 868535843 871460876 869153748 866232147 868826752 869082184 867640228 861944199 858729706
1112.5 858729706 862191162 864909592 862477646 859866257 859135132 861214676 860144653 859374771 863834305
1116.8 863834305 866312103 865803833 871470413 875875168 877072525 876513519 877435913 881349411 880827637
1121.1 880827637 881258011 886189270 887242966 882760773 882158127 884325027 888157043 887774582 886886826
1125.5 886886826 887097092 888844223 889302902 889031982 890143433 887050400 886903458 889969788 889180832
1129.8 889180832 888360825 889199600 889333191 890063629 890229340 887624893 885140915 885958023 891202774
1134.2 891202774 891155853 887448120 886523590 887770996 886269379 884620132 880657654 878204956 882128906
1138.5 882128906 883330383 881572266 878529892 874654694 875221252 874750290 868624573 865145645 858838272
1142.8 858838272 850093613 848187943 842712555 830586700 817689438 806976395 793506470 781653900
1146.7 781653900 779169083 779855728 779912796 784548569 791019897 798971329 806141663 810875931 812875824
1151 812875824 815921326 817755051 811666870 800993729 792100296 783560181 776843262 774731140
1154.9 774731140 774706268 774622421 778418045 786812592 794281693 805346146 818313828 831002045
1158.7 831002045 839860458 848347397 856564789 860349884 865912094 868616867 869967346 874066696
1162.6 874066696 876245804 877877731 884000778 884748001 885169296 884251556 883614502 883475800 886668701
1166.9 886668701 885757217 886677551 889385757 892595749 893097687 892979431 895690308 895219727 891448593
1171.3 891448593 893154678 893718872 892242966 893935471 896212616 894350128 893632431 895791168 896988220
1175.6 896988220 898963699 900983810 897515717 889983521 888487320 892066879 894311829 895465469
1179.5 895465469 895510864 897257614 898891144 897903748 894858322 895043716 897555237 896333694 893333359
1183.8 893333359 893385620 892648544 893788528 894042740 893192444 893930664 893822556 896380234 896102066
1188.2 896102066 894822159 896952515 896991653 895283356 891276245 889643173 892529373 892975159 890559158
1192.5 890559158 890209808 887203522 883477020 882400589 879473724 878528137 877883224 873795319 869131775
1196.8 869131775 865406494 861425858 860018539 859692230 861205139 865199203 867108307 868282547
1200.7 868282547 870614624 874014130 875692444 875394440 874864731 878110352 879813461 879189529 877843018
1205 877843018 876254425 874373093 873897171 875389862 875890045 872743683 874962311 879536743 883435593
1209.4 883435593 886078644 888070221 891762772 892575378 889300919 886065750 887565384 892789688
1213.2 892789688 893494644 892919617 895189743 892437897 889571304 891382980 890389481 888610687 889177551
1217.6 889177551 888145065 889670792 892341995 891003647 889406128 890148087 888875198 887196960
1221.4 887196960 883881760 884715500 884898376 881077194 877430496 876987686 874667511 869767532 866360474
1225.8 866360474 865227966 862125549 860462723 859944916 860236740 861660538 865235291 868030701 867718811
1230.1 867718811 869613495 872142410 872004013 868713760 866094589 867339935 867607193 867903900 865998001
1234.5 865998001 862471313 861564178 861428757 863612823 862933426 862290039 860937805 858197632 858974304
1238.8 858974304 858381348 858643494 860961533 862932816 862813568 860129089 859194412 856208572 855677338
1243.1 855677338 858788376 859892654 860675354 859830551 861266785 863594666 864868164 868786011 872120438
1247.5 872120438 874697800 876347656 874397430 874854965 877465057 876478271 874878159 874447403 871460419
1251.8 871460419 869688110 872492599 871412354 867502365 867246704 867796783 867575150 868657761 870597534
1256.2 870597534 872454224 874571457 873538589 872154083 873651428 875285034 877543793 879911728
1260 879911728 881291351 881115723 878165436 877135773 879125061 880443268 883593063 885091934 882129745
1264.3 882129745 882018585 883031693 882310638 882656555 884744034 887467422 888256760 888575745 887917709
1268.7 887917709 888787994 889052887 887226791 886035843 882616730 881008377 880388641 880880127 880234604
1273 880234604 880356827 880603409 878594284 877475891 875069046 873573456 874062042 874587173 875341187
1277.4 875341187 876143646 876525116 876389542 879400177 879206543 877222061 878609543 880295258 882231522
1281.7 882231522 879455948 874554062 871881332 871063004 870012207 869142151 869560623 868130646 866730499
1286 866730499 867323151 866683044 863029251 859665375 858850403 859655991 862912750 867055054 869418793
1290.4 869418793 870673676 870741882 871426773 874018250 877172699 876973038 877033844 878086014 878460464
1294.7 878460464 876590195 877338791 878255539 876949692 875001831 874942322 876649399 877653961 878902130
1299.1 878902130 878539581 875408096 874313583 874039688 871198196 868520889 868406754 869946136 870222397
1303.4 870222397 868824692 864805069 861220627 862209015 862745438 862541122 862452164 861956940 860957642
1307.7 860957642 859530487 858317566 856481323 854968262 852334366 850944290 851472778 854850922
1311.6 854850922 858748169 861377716 861721344 862679443 864122086 869015121 871597519 871382980 873635406
1315.9 873635406 876290054 877350540 876525497 877687225 879079208 879015808 878734589 878165436 874079056
1320.3 874079056 873456726 874095840 873992081 874454498 873153839 871541748 870421677 868485870 867184982
1324.6 867184982 866720505 865534515 863129654 860492401 860000916 860358887 859782257 859722290 860322647
1329 860322647 862291260 864241409 863660355 861773682 861154633 860106812 859508057 862158585 865961914
1333.3 865961914 867250977 866906433 866571426 867495422 869782867 871277618 869608917 871673050 870908051
1337.6 870908051 870791550 873996353 873316269 873248672 873898010 874036942 875435486 876059799 874969482
1342 874969482 873327026 873637390 874868088 876657028 877291489 878174820 878191833 875418167 875144577
1346.3 875144577 875444412 872974472 873490372 874381180 872288513 870998688 872777176 872349243 872520142
1350.7 872520142 870927124 867527847 866283035 865060425 863362885 863288727 863456345 864939804 865049515
1355 865049515 864402008 865127182 865955276 865809250 863787460 862182159 860803909 857931900 856660919
1359.3 856660919 858328247 860023880 857751999 852818451 853097534 852946854 846730499 836886139 832457047
1363.7 832457047 831874695 829377441 826294556 818770905 812087936 807926636 801660614 794821243
1367.5 794821243 787727585 775825195 764117889 755892715 749900436 740127029 730191650 722489243
1371.4 722489243 716358871 711869202 706544113 698801193 686037750 675398560 666042938 652049255
1375.3 652049255 643901215 638484459 633116341 631349678 638835983 655325012 675645218 697099533
1379.1 697099533 717894745 737380066 752507324 765514297 778472595 788146286 792596436 798701630
1383 798701630 807794724 811836929 817041855 821141205 822474823 825595779 830542603 833146820 831390610
1387.3 831390610 826729431 831022415 834171524 835797272 839352570 839426346 841103745 843467941 844062500
1391.7 844062500 845409470 845440063 847871552 853199081 856223297 847684174 843604965 844980774 844029236
1396 844029236 847448654 849352646 849752731 851636047 853116913 851546631 845191422 845861206 850031357
1400.3 850031357 851537933 849449692 850028229 853593903 851343613 847494812 848899155 853869934
1404.2 853869934 854748154 848959122 845564957 844862289 845782242 846515961 845949554 844196091 843285141
1408.5 843285141 842384949 841446533 840889816 841175995 840758133 838566360 836159668 836063309 834434891
1412.9 834434891 832767944 832405243 831531219 829690704 825928726 826021271 827571945 826820908 824215164
1417.2 824215164 821303177 821961365 823383484 820343399 803588867 804150696 803476181 799157562 795317001
1421.5 795317001 790971451 788175583 786824493 782287292 773516235 764851303 756210632 748239670
1425.4 748239670 741976089 733926468 722939377 711641693 698671646 685964432 674759521 662181549
1429.3 662181549 648260803 627252579 613139458 597397461 583395538 571260300 558162460
1432.6 558162460 545768089 535439339 524193916 515478554 511039124 510552979 512672424 514195824
1436.5 514195824 497240372 497547913 503222733 510421867 517697563 522422028 528240356 532534065
1440.4 532534065 533345451 538224487 543444481 548519516 553307648 558180275 562062798 566068993
1444.2 566068993 570127068 574328804 578832207 582743263 585672455 588846359 591202545 584329529
1448.1 584329529 580396729 581465759 577694130 573394699 568300972 563974380 560322914 556644325
1451.9 556644325 551213913 550917053 553518562 558910408 565107307 573785095 586810989 602173538
1455.8 602173538 619087982 638478394 641262283 651320267 662355804 673559418 684676285
1459.2 684676285 697544098 708096008 715639267 726723785 737615433 747177811 759080276 767645187
1463 767645187 774299011 781297684 787756882 787397919 789767761 793965912 798697052 805137177 809727707
1467.4 809727707 813623657 817443695 819857407 821858368 825398178 830152969 834933472 837838058
1471.2 837838058 844188614 844592133 842311096 845741730 842009430 842803574 845617599 847214813 850920181
1475.6 850920181 854249725 848906326 851438980 853042374 852668228 854246140 854317627 854238892 855529861
1479.9 855529861 858249969 858846130 856962128 857954407 860489120 862154770 863958740 864207611 862493439
1484.2 862493439 862904205 865004349 867433701 868355331 872480698 874864883 871676254 871621933 873520889
1488.6 873520889 877411652 880927429 876534195 873724670 872655945 872707520 873176193 874071808 875251465
1492.9 875251465 874088211 873238449 875076370 879172363 883031006 883154984 871658707 870557251
1496.8 870557251 875906982 879737854 882092056 878635178 872916565 873834381 876684570 877432556 878978424
1501.1 878978424 877947006 876604309 881804733 880860443 876636124 878893585 886310120 894379120
1505 894379120 893446655 884985428 892515640 896894150 887549515 885862656 882328110 878755646 884073410
1509.3 884073410 882039566 878643188 881094055 884092255 886361923 881121063 877075653 881513062
1513.2 881513062 880115280 878125458 881391525 879013367 877258377 883960495 890237808 887284927
1517 887284927 875169449 872486572 880817413 885994797 888895111 890376129 889404373 889869080 876966705
1521.4 876966705 878166885 884856720 881657257 884542160 887193375 888304062 891565552 888505325
1525.2 888505325 879333420 884229431 887746124 885352478 882652512 884235229 884480820 884109726 884344254
1529.6 884344254 884470139 887375031 887409668 885780792 884473572 885659561 890169220 888581085 881614380
1533.9 881614380 882686081 884466324 881983643 881239471 882542267 884658508 886531219 892028275
1537.8 892028275 901693192 908171768 899942627 901245499 890924759 882971573 892655716 896081924
1541.6 896081924 886950989 884028320 885346527 883617401 885941849 884496384 881297226 880030518
1545.5 880030518 883735733 883118515 881702042 885238190 887243347 886112823 887008743 886929626 883657684
1549.8 883657684 879238205 878068085 879458466 879983673 883539963 887464447 888458328 889183655 880606232
1554.2 880606232 871333313 877162781 880880890 885272217 890292969 896179581 903132935 899408417
1558 899408417 880697632 882061157 895479050 889453125 870138474 875777130 878697662 879797440
1561.9 879797440 880963593 882822342 883636322 883432465 883793182 879504700 878567429 880498581 879800034
1566.2 879800034 879341278 881348877 883618088 885005569 883161926 883242187 879748077 873117981 876345673
1570.6 876345673 877910843 877231064 875457077 875981293 877120132 875941772 874356766 874100189 877412109
1574.9 877412109 880554199 878133240 865501633 869744034 870462723 868917236 869888306 871936188
1578.7 871936188 874301071 872422028 870515060 871139450 869008179 868126144 869337921 869196625 868702850
1583.1 868702850 868016434 867232361 866166916 864431763 865449066 865847244 864930038 866126404 866704865
1587.4 866704865 865185165 862980423 862907867 862732544 863188705 861902008 861360779 864599762 864205246
1591.8 864205246 861736298 862620316 863845291 862520294 861247406 861566467 863521500 862837677 863236389
1596.1 863236389 861516953 859647827 862490997 863024063 864028320 865675888 864922104 863312759 864291687
1600.4 864291687 866591568 867656860 869268265 868761368 866943436 868032913 868821564 867622375 865432968
1604.8 865432968 864635696 866253433 868329315 867774200 866708145 865294571 866017761 867568741 867815323
1609.1 867815323 865677948 863652725 865885773 866993942 864651413 863118362 862478333 860411530
1613 860411530 859275665 861301498 864765396 867682953 868564529 867554092 863360062 850485153 855535049
1617.3 855535049 858835754 859053955 859789810 862210159 859939270 858161011 857924576 856102524 855154114
1621.7 855154114 855656586 859261780 864722672 857260666 848142242 848882294 849688644 850017319 850428925
1626 850428925 849883728 851493988 851671371 846479645 843237839 841561127 839339905 836270065 833835754
1630.3 833835754 833920746 832177200 830508652 827322693 825230484 823610306 821545639 821288147 821702118
1634.7 821702118 813058243 786888580 777344208 781084290 778698959 763687439 749018478 739790497
1638.5 739790497 727251129 711305923 692384262 673586426 655783234 636353951 618278656
1641.9 618278656 602020760 585886993 573717384 566989479 562573814 562888603 568119202 574621964
1645.8 574621964 572896957 586839867 608477783 629618378 646684265 667308578 691080170
1649.2 691080170 712302551 732598038 749877853 764089203 777757339 790551376 805982742
1652.5 805982742 814626083 814042053 824858017 824822006 822939529 830850296 834995651 837912750 839954834
1656.9 839954834 843979111 845654144 847636108 849096680 849136276 851019135 853811417 856697922 858291168
1661.2 858291168 859786758 863126526 861904297 855051117 855617676 857728806 857066422 856300125 858160248
1665.5 858160248 861305923 861241074 862123413 865089645 866508484 867039871 867739487 859331512 859037018
1669.9 859037018 861773758 863558807 863630142 857597961 858085709 860908661 861108017 859269257 861377182
1674.2 861377182 865774002 855596161 840319824 848374786 852106094 853049698 853986893 853076401
1678.1 853076401 852689743 858407898 864563446 864459991 863693237 863010025 865339661 871298676 878785934
1682.4 878785934 881188354 879135361 879144516 876443329 862665405 865700073 875661850 878540192 878151245
1686.8 878151245 878948135 879914856 880746841 881643448 882846985 881881714 879348602 879649124 880516510
1691.1 880516510 880200119 881048813 880424576 880750504 883831863 884422455 887701035 893227158 890225677
1695.4 890225677 870808258 873987045 881614075 883502426 886393204 890295868 894119263 898564529
1699.3 898564529 899058838 872507629 859520721 873979950 878893738 880089188 883111420 885282669
1703.2 885282669 886544876 885228424 884828491 886991653 886096878 884361725 881277237 882366028 880493240
1707.5 880493240 877364960 876608200 874743195 875236816 878962631 878692932 880447693 880929718 879674072
1711.8 879674072 879727402 879985657 883195724 886251068 885291214 884491653 881225357 881536942 885152512
1716.2 885152512 889539719 889735641 880905457 887478485 885040741 881543732 883741302 883220444 882744904
1720.5 882744904 882793884 881177292 881674271 884008484 883677368 883046646 883412399 883038025 883742828
1724.9 883742828 884902954 882998428 883782120 887097092 886266403 887530594 887945862 889130020 891102829
1729.2 891102829 888264008 886424942 886388321 888051682 888109055 890953979 896008377 900022583 896715317
1733.5 896715317 892281647 879026642 874617996 884017334 885085831 883872452 883682022 884408035
1737.4 884408035 885723419 889931259 892241211 892122269 885158157 881150055 885107040 886552734
1741.3 886552734 887248459 890115585 891503677 889904251 888976517 886889191 887179565 886984024 887388840
1745.6 887388840 887276917 888058395 889663849 888042145 887285004 886138992 884696198 888535538 889057770
1749.9 889057770 889079208 889447174 884081039 883327637 885587845 885754242 887327347 887107773 886041260
1754.3 886041260 886272964 885671616 884384384 884856262 881481323 878978653 882243195 883873062 882688141
1758.6 882688141 882588348 882143936 883159943 885134964 885043869 883648834 880494995 880279617 881696777
1763 881696777 882472687 883053665 881655579 881573334 879970169 879619522 883216705 882077789 880006332
1767.3 880006332 880196533 873562775 871150208 875386810 879312210 880174332 883354950 881504517 875634689
1771.6 875634689 879513855 875538254 864470825 867528458 869075775 866344528 864941788 865088577
1775.5 865088577 862638245 862698975 861562881 860503616 862205734 862131424 860774384 860722046 862259674
1779.8 862259674 862593536 860229645 861796951 862721405 860354996 861402512 862720947 863461227 864311142
1784.2 864311142 862188797 859846954 862187424 864811020 865015488 865647507 867079086 867969131 868480606
1788.5 868480606 869171066 870917206 873589325 876335831 878220673 876455460 878092422 879590912
1792.4 879590912 871176758 870657272 874633484 877152481 878301239 877865067 876318130 876312790 878382645
1796.7 878382645 881042175 882253647 880686874 879096146 880575562 880890503 880662766 882678375 883474045
1801 883474045 882995148 882869644 883083954 884235077 885794144 884992218 884508896 883588943 882732925 884375229
1805.9 884375229 883406143 881843567 884221115 885165024 884983215 884084549 884297485 885188751 887282715
1810.2 887282715 886047592 884616318 884648819 881945419 880549316 880717239 880761185 884978714 887677002
1814.5 887677002 885908966 886653595 886307983 884056778 885104980 888456497 886349106 883132095 883003922
1818.9 883003922 884744949 885389328 883713150 884964752 887279358 889760132 890249252 888486176 888944778
1823.2 888944778 890419159 889877090 888819580 884813919 881320953 883678055 885076675 884153519 885050964
1827.6 885050964 887615051 887272720 888387680 886026001 881766434 880808945 882511215 884418716 884668274
1831.9 884668274 882587585 884344635 885949860 888471832 888403244 886626053 886544952 885372849 886950760
1836.2 886950760 887974319 886020508 886717224 888294067 887897568 887993469 888524323 888989716 887937622
1840.6 887937622 889298859 889065552 887556839 887662811 889967880 892792206 890178452 879400864
1844.4 879400864 881578064 886978226 888780212 888755112 887979431 887014389 886466064 885727539 883643417
1848.8 883643417 884313660 884649353 884095154 884163818 883688354 883436813 883796158 884314117 884419937 884474716
1853.6 884474716 884835281 885949707 885607529 885680008 886872253 885416336 883604355 884662018 885535355
1857.9 885535355 886464157 885051346 886156158 886726456 885554962 885905838 884319763 884276199 884776077
1862.3 884776077 884396667 884426804 884067612 886522369 887065887 883729095 883576126 886497498 889223862
1866.6 889223862 888544540 886956024 885542755 888641205 890995178 885010834 884300995 886051331 884449539
1871 884449539 883822556 884050217 882568359 883031464 882175446 881118393 882180176 886251984 886945877
1875.3 886945877 885724411 886138916 886692352 885247192 883628235 884116745 885089493 885637283 885541992
1879.6 885541992 886420670 886725540 884924393 882141418 881172333 883524857 885184784 886299133 886825867
1884 886825867 884837341 883764191 884509201 884927139 885585785 887004471 888320694 887729721 887320709
1888.3 887320709 887271881 885566864 883564453 884146729 886026382 886786652 886199875 884333878 884756241
1892.7 884756241 887927933 887419434 888260727 887628860 884333267 884418106 884192963 883784637 885053787
1897 885053787 884245071 883724594 884882660 885607147 884588165 883521042 884330368 884138107 884696960
1901.3 884696960 885686874 883416367 882183533 883557587 884260101 885043106 886629333 886617508 885546646
1905.7 885546646 886514816 885750046 885406952 885509491 885096054 883514328 880748596 881458054 881922760
1910 881922760 881254730 879641266 879373474 882883835 885000534 885068741 882568893 881424942 884485703
1914.4 884485703 885426788 886254654 887074127 886143646 885512543 886095886 884469604 883415909 885460358
1918.7 885460358 884532852 883809967 884269485 885597229 887575302 887768860 885327759 884480057 882710190
1923 882710190 881444244 882686615 883163376 882469482 881108322 881003647 882253036 881977615 882522812
1927.4 882522812 883745575 881166840 880451202 882158737 883023300 883085175 883941574 884068069 883861618
1931.7 883861618 885425339 885245132 883472214 880878296 879529266 881028748 883246002 882545776 881274796
1936.1 881274796 879893875 880363388 882565613 880148773 878091736 879318085 881416245 882902298
1939.9 882902298 884065704 883961487 882703857 883192902 881483994 878268204 881012268 882136765 881678238
1944.3 881678238 882982941 881127625 879585342 880935287 881690063 881732712 882411804 881374664 882223969
1948.6 882223969 882740250 881792221 881672821 880418015 878300552 877412720 879553680 881361465 880915451
1952.9 880915451 880640945 880108795 879768066 880975342 882464600 883093033 882311859 880469208 880792847
1957.3 880792847 882122116 881831741 880813370 881029358 882799759 882784882 881308823 879589996 881636734
1961.6 881636734 883169632 883568573 884450073 884491730 881135864 880289459 883059998 884120026 883485794
1966 883485794 883405914 884584198 883458557 882401505 881926041 882048645 885078278 884684525 882496719
1970.3 882496719 883523178 884738159 885037994 884675522 883594131 882810822 882537537 883139572 882969666
1974.6 882969666 882040939 882131805 883554611 883768158 885110703 883702774 882233124 882875061 883133698
1979 883133698 882704620 881105957 882504272 883013916 882912064 882894363 880481567 879524231 879457245 880286942
1983.8 880286942 882608719 882517624 882327728 882212143 883581848 884553223 883050995 881516876 879426575
1988.1 879426575 879857635 882910004 882846146 881033325 882265091 884536209 884922943 883314133 882291336
1992.5 882291336 881059494 882124557 883439789 884034882 885112457 884366455 881874390 881089172 882013550
1996.8 882013550 882301102 882078018 881422958 880439224 878654099 879465103 882272034 882380142 883373871
2001.2 883373871 883211746 881956177 881872025 880727615 880928497 882511520 880797348 877965317 877140732
2005.5 877140732 877138596 882057648 882441101 881642685 881282730 880668335 880625381 881951675 881574326 881961975
2010.3 881961975 881751480 880517273 880396576 880603943 880259857 879561005 880123444 880095596 881149216
2014.7 881149216 881340332 880583649 882713928 883828506 883140182 881647263 881762772 881749268 881585312
2019 881585312 880857773 881152267 880638275 880605316 881101379 879876556 879693756 881137772 880591812 881920319
2023.8 881920319 882613373 880055466 878789825 878588409 877894211 880437469 883380432 881393967 880216446
2028.2 880216446 880137711 880598297 881934662 882548599 880079422 878321457 880488052 881119232 880908203
2032.5 880908203 879648895 879060440 879163589 881227188 883103485 883091507 879825439 879295197 881258621
2036.8 881258621 882530670 881183014 880849304 882369614 881199875 880780258 879115067 879180756 880629578
2041.2 880629578 879769058 880619736 879426193 877762070 879478989 879536285 879392242 879640579 879785614
2045.5 879785614 880415726 881888580 882535858 882320709 883587189 883105011 880722198 878815842 878089676
2049.9 878089676 879231796 881660538 882845612 880970230 880119934 879225388 877701187 876687622 877200089
2054.2 877200089 877198944 878250809 879314728 879184189 877254715 876381836 878256302 878984222 878664169
2058.5 878664169 878268433 878647614 879550476 880214081 879903259 879132843 877740250 877967224 877974625 877784958
2063.4 877784958 877656860 879726791 879190903 878699875 879996490 880191498 879244843 877332077 876729507
2067.7 876729507 878668518 880655289 880358429 878640289 875978622 877562027 879844055 879683228 879529190
2072 879529190 879854889 880155258 879241638 877447815 875650177 875107574 876783066 878852921 878506317
2076.4 878506317 878981476 880172806 877616272 876236649 876659088 879662094 880407333 880708008 880464630
2080.7 880464630 879184341 878282471 879958267 880297318 878634491 878492126 878923035 878349991 878675308
2085.1 878675308 879120636 876995087 878694534 880415878 877868195 878528366 878493423 878568115 879661255
2089.4 879661255 880047913 880759811 881346054 879110641 878492126 877316513 876971893 876616974 878015976
2093.7 878015976 879924011 880727997 880185013 877591705 876584702 877189713 878381958 879889145 880504303
2098.1 880504303 878695221 875894852 876657562 875854797 877231293 878560181 877232590 878307114 877351303
2102.4 877351303 876507416 878965378 879455490 879424210 878594666 879110794 878039856 877439423 878631973
2106.8 878631973 878805313 879723358 881414795 882635117 882306519 881918945 879960785 877650604 877534256
2111.1 877534256 878473511 878723831 879794922 880315018 876557922 876350861 878820419 878280716 878858032
2115.4 878858032 881280899 879958496 878369064 876987152 878885498 879833069 878092575 878129807 879359665
2119.8 879359665 882119217 881398544 879229813 878188934 877059097 877057037 878088303 877716751 877713928
2124.1 877713928 878191528 878416977 878142395 877541580 876159439 876347351 877399902 876909943 876626205
2128.5 876626205 877731400 878158188 876639709 875906982 876329727 877526855 879024811 878789978 875482330
2132.8 875482330 874136047 875908279 879004593 878540497 877714081 878128815 877637634 878686905 879281158
2137.1 879281158 879505997 877743301 877149734 879250412 878379974 876701813 875467148 875744095 877257614
2141.5 877257614 878072586 877564468 876926804 877296677 878022766 876485214 875396271 875745010 878105240
2145.8 878105240 880443344 879845810 879012985 876819305 876426315 876427841 877016983 879493790 878949509
2150.2 878949509 877016068 877117081 876723328 877576370 879803696 878475113 878385391 880224304 881353378
2154.5 881353378 879796143 878189163 876395569 874378586 873608627 875851364 875915909 874534683 875660706
2158.8 875660706 876334763 877121429 878644028 877593079 876110153 876047745 876785507 876130753 875498962
2163.2 875498962 875509644 875455322 874600677 875139542 875076141 874883881 876242828 877034531 876259537 876668396
2168 876668396 876871872 874685974 874981079 875770340 874962311 874892578 875392990 877356033 876832581 875732269
2172.8 875732269 876367264 876368408 875330658 873638306 874215393 873800659 873337326 874152985 875043716 875887985
2177.7 875887985 874934921 874853897 875780182 873781891 871699142 874457092 876475830 875605850 876214828
2182 876214828 877422485 877804184 876998215 875391388 873515015 874344940 877452087 879065399 877228165
2186.3 877228165 875958710 875023499 875466385 877262573 875073776 873931732 875140686 875857391 877830505
2190.7 877830505 878039474 877868423 875972214 874523163 873878555 873698578 875421829 875090942 875349045
2195 875349045 876540298 875734024 874492264 873221817 873662033 874588928 874877930 873564682 874934464
2199.4 874934464 876339645 875357513 875076599 874521866 873026199 873255157 871792221 871251221 874045944
2203.7 874045944 875157852 874704208 874663315 873920059 872374420 871396408 871694946 872112732 874582062
2208 874582062 875619431 872989502 871585007 872851791 874383698 874987564 873914413 873877029 873293533
2212.4 873293533 871702194 872942429 872599030 872904663 876161346 876213913 873673706 873866577 874307785
2216.7 874307785 875528183 875254059 873333282 873929977 873476181 873817444 875696564 875908356 873709412
2221 873709412 874018707 873668671 873256226 874362183 873956375 875205994 874702682 871691284 871995697
2225.4 871995697 874115143 876240768 874218674 872373199 872476883 874008484 874651108 874903641 874263840
2229.7 874263840 874759750 875007172 874106979 872420731 872790756 872115479 871685333 872616959 872490234
2234.1 872490234 871265411 873098755 872758255 871884079 873169174 873160095 872729950 871445923 872007294
2238.4 872007294 873423996 873535538 872676010 872284698 874444504 875467453 873500977 872929840 872178955
2242.7 872178955 872157135 873516922 873227692 871086349 870894394 873377609 873664627 872611923 871462021
2247.1 871462021 872129745 874726791 873447266 872391357 873445663 872741928 871583557 871899643 872783203
2251.4 872783203 873856354 875100479 873262024 871234665 872059860 873233643 872054825 871522217 872993774
2255.8 872993774 871598129 870176773 871476440 873187943 873783722 872477798 871532745 872769318 872953720
2260.1 872953720 872815781 874317627 875503082 873961563 872826385 876097260 877300491 876305237 876909409
2264.4 876909409 873582611 872673874 875636215 875367584 876712952 877099075 875941238 873761597 873528061
2268.8 873528061 876136627 874230957 873894272 875177307 873051910 873691864 875988235 876951294 875063248
2273.1 875063248 873046036 871817780 871427765 873579407 875306625 874537277 874807663 876010437 875581360
2277.5 875581360 874937210 876443634 876639786 874318466 873429260 875894699 876131744 874611435 874764862
2281.8 874764862 873797684 874294205 875145874 873736038 872740173 872833939 873029099 873813629 872749710
2286.1 872749710 872881393 873615417 875694809 876147232 875223007 874894104 871791382 872285309 874825592
2290.5 874825592 876444855 877793732 877071381 875877380 876770554 877131805 876482544 876700745 875731201
2294.8 875731201 875761795 877399368 874275894 874357376 877287216 879201279 881288986 878826904 877305222
2299.2 877305222 881574249 884905319 886302719 884042435 883614044 885551300 883407516 882840958 881886902
2303.5 881886902 883082352 885239563 883732758 879854584 882263184 887740479 892782745 891166229
2307.4 891166229 887625885 888177643 894431763 895928497 889981689 891346054 898047714 900194702
2311.2 900194702 895569077 893569641 897336578 898843002 896054687 894238358 897435074 899845886
2315.1 899845886 895253525 894345856 896710434 898825302 900282745 897175064 903728485 912115097
2318.9 912115097 908590317 900109787 901098022 911575470 911816254 902974243 907549286 919078827
2322.8 919078827 917688599 907263718 909795303 922721405 919903412 908209686 909975662 917566299
2326.7 917566299 919424744 911041794 914105759 922597656 918265152 915450516 913789673 917397690
2330.5 917397690 921300583 918755646 920513687 920283279 915867615 916179199 920314941 922633667 914183807
2334.9 914183807 914259567 921886978 927427216 929607620 933927612 938521423 930642853 925185471 921517105
2339.2 921517105 918040085 913944626 915806961 922317963 921769333 926066666 931022949 923684921
2343 923684921 921728058 925911484 926078568 918769760 917154083 919964828 918037338 912011185 908907547
2347.4 908907547 902853928 894159241 894866180 903398819 912722549 917336884 914783859 916440735
2351.2 916440735 917708817 917292252 924593277 929661713 928654861 933559189 931027298 926080017
2355.1 926080017 938973999 948674469 939773636 938980560 940720673 944761505 951358871 949430008
2359 949430008 940921478 939755859 935100861 933840027 938735352 944234848 947252731 936305847
2362.8 936305847 928227997 935428314 931849594 935041885 945327911 943096924 938129501 931494293
2366.7 931494293 926629791 928963776 930861359 923788605 921823502 922657318 923327942 915843887 910359039
2371 910359039 909050293 912763367 910116959 904608078 898798599 896729584 896742935 895819092 894526138
2375.4 894526138 894985886 895905304 894136124 889934082 888965607 886760559 884060669 884231567 881135025
2379.7 881135025 876956711 875139923 873257675 871911240 872780609 873776245 872074814 871339264 872725067
2384 872725067 870978317 869881516 872430878 872311630 868874969 868602753 869231796 869464874 871092606
2388.4 871092606 871404190 870255280 868372498 869974442 868805084 866380615 867510223 868031082 867318497
2392.7 867318497 867583084 868089294 866865692 868049164 868353119 868667526 870058746 869328842 868242264
2397.1 868242264 867190247 866200180 865653381 865877762 866915894 866998825 866755295 866818237 866924820 866892395
2401.9 866892395 867409210 867930069 867420654 867756042 869217834 869175491 868797531 868946152 869146500 867122803
2406.7 867122803 868547821 872625732 871855316 870173798 868951950 868670425 869183273 869222565 867682037
2411 867682037 867179718 868693924 868230667 870098190 871204224 869955139 868781433 868714294 869768906
2415.4 869768906 868914566 869162903 868625717 867444916 868505707 867734375 867237701 869742126 868682632
2419.7 868682632 865744858 863729248 866358719 869033813 868248672 868567581 871670685 872226562 871060486
2424.1 871060486 868917542 867038116 867602463 871381760 871613770 869491730 867645111 866152802 867983780
2428.4 867983780 871018753 871175613 869116440 868417740 869410934 869519577 869446716 867802277 867702866
2432.7 867702866 869066238 869731293 869179153 869469833 868438721 869441605 868816986 867079163 867706299
2437.1 867706299 869699783 870783539 870685349 870548019 869453964 868991241 869910889 870345993 869027481
2441.4 869027481 867919235 867489395 866585541 868647308 870826645 869632874 867537308 868398666 869137650
2445.8 869137650 867970200 866792755 866344147 867451096 866376648 866382675 867145920 864345474 864315414
2450.1 864315414 865270996 865720367 865322800 865053177 866196365 866375427 865556030 866331024 867600632
2454.4 867600632 866957397 864436417 864844971 868294067 867143478 865447540 865894928 866093597 867026825
2458.8 867026825 865915451 865160446 865348663 866575394 867981110 867735367 868011551 868707962 866740952
2463.1 866740952 864598694 864766693 864809113 865359344 864944382 861751556 862523270 863530121 862542267
2467.5 862542267 864169998 864599533 864500656 864927139 865261078 864353333 863592682 864925156 864026642
2471.8 864026642 865270615 865183411 865414963 865619736 865510254 863300247 863248291 865437393 864300079
2476.1 864300079 863333817 865269012 864447327 862273483 864226837 866320648 866057281 864070282 863908844
2480.5 863908844 864260025 862760849 864600754 867658615 866692963 864999542 864715271 865218277 865401382
2484.8 865401382 864747009 862565994 863720398 863395920 863981018 867221909 867143555 864565353 864511642
2489.2 864511642 865222168 864463043 864844971 866728210 864944305 862396393 863691406 866550674 868035889
2493.5 868035889 869329758 868434601 867102966 867352448 866714325 866891785 867280426 867059937 867723236
2497.8 867723236 867139893 866142197 867467346 865748749 864326248 864979706 866250610 867497787 866564026
2502.2 866564026 864887543 864237900 865279007 866450882 865885696 865398331 864233093 862541351 863640213
2506.5 863640213 865913696 865744171 867168808 866459808 866313553 867847977 866643219 864685287 865669098
2510.9 865669098 866027451 867558441 866922073 864756622 863070145 863313446 864508591 863906403 865829163
2515.2 865829163 866513596 866988602 867039413 866143799 864292679 864536972 866641312 866013031 864481888
2519.5 864481888 861870651 861949921 864084473 865317764 863266830 860338593 859624939 862175522 865099716
2523.9 865099716 864337769 864880219 866485825 864440689 861752090 864369812 866576309 865512161 865348892
2528.2 865348892 866434708 863185730 859449234 859943542 861430740 863029022 864815063 866994705
2532.1 866994705 865935669 864983063 864789124 863216934 863270874 864875946 863075027 864252167 866157074
2536.4 866157074 865233459 863843460 862951431 861105576 862188797 863275909 865174942 866539307 866631393
2540.8 866631393 865604324 864200516 864990311 864966812 864455032 863317642 864328003 865364685 865356445
2545.1 865356445 865433350 866678391 866893005 865426331 864422379 863886795 864996643 866268158 867382507
2549.4 867382507 867333984 864208145 862229538 865552597 866284103 862248993 860085526 861549835 863455505
2553.8 863455505 862573242 861794586 862103348 862306747 863537827 865503082 865523453 863864136 861649551
2558.1 861649551 860799103 861295166 861834412 863091736 861237183 862961578 864529190 860779800 859302902
2562.5 859302902 860867157 859799576 858891144 860377502 860753784 858692398 857848282 860435944 862006302
2566.8 862006302 862760468 861765213 860961609 861553192 860330887 862127686 863835144 863329773 863022079
2571.1 863022079 862735367 862264786 860193634 859306793 860008698 861016922 861711426 862306137 864203873
2575.5 864203873 865394821 864664383 862224655 862136993 864211044 864108505 864747696 864193115 864043808
2579.8 864043808 862729721 860514069 859498978 860472717 862170105 864414444 864339600 863361053 865267105
2584.2 865267105 863615646 860630569 862162094 861430817 860537262 861824341 863381805 862771301 863655472
2588.5 863655472 864313278 863974686 861618347 861416855 861078415 860798416 860442047 860225220 860617752
2592.8 860617752 860046768 860081329 862030106 862929230 862501068 861937790 860934677 860091248 861275787
2597.2 861275787 860807037 859623947 860380325 858129196 856713028 859274521 859206924 857897415 859464035
2601.5 859464035 857778168 858074341 859123459 858024979 857097244 855049744 857159348 860150909 860374298
2605.9 860374298 859258652 858164444 857315521 856305008 856104507 857461166 857932205 858417435 858556290
2610.2 858556290 858024292 856650238 858159714 860742493 859942093 858568344 858529816 858010406 856643906
2614.5 856643906 855625992 856778793 857660904 857819443 858994522 858273773 856459808 856228180 855213013
2618.9 855213013 857153931 861802292 859624939 857916336 861288452 862808685 861191483 859431381
2622.7 859431381 859249420 860210419 860486145 858644791 857108917 858631134 858792648 858899918 859642563
2627.1 859642563 859105682 860696411 862879562 861657486 860675735 860977402 859107056 856679382 857322159
2631.4 857322159 861137009 861336746 859080963 859901962 861394348 861108093 860705872 861459579 860154953
2635.7 860154953 861124191 863576126 862722855 860723495 861868057 861014252 859066772 859381638 858997803
2640.1 858997803 856215286 857918320 862968140 865178604 863267746 860868073 857803574 857237015
2643.9 857237015 858066864 859679565 858644257 856135101 859517441 862181396 859131775 855538101
2647.8 855538101 856409302 859418106 860893555 864300232 865660400 861206436 857076721 855284958
2651.7 855284958 855459213 857635803 858961945 857439117 856164703 857354355 858997116 860468674
2655.5 860468674 861791306 860704651 857193680 854792786 855022507 856174850 855999756 854887619 853768921
2659.9 853768921 854837341 857471619 856815033 855997162 853233871 851613998 851388245 851670990 854968719
2664.2 854968719 855823898 853239899 850755768 850450516 852993851 850073166 844784317 846481934 849458923
2668.5 849458923 850529099 849605484 849757767 850571060 851842499 852494354 850850220 853836746 855888824
2672.9 855888824 852613983 850862045 853648376 855249557 855489807 856839371 856494827 854018707 854592285
2677.2 854592285 858289642 856913452 855237808 855834427 855781784 856486664 856527176 854237518 854330063
2681.6 854330063 856085968 855526733 855840302 854242401 853798676 857604752 859892044 856947479 855346680
2685.9 855346680 855818405 857693100 860128555 859999466 858169250 856866455 856934586 856662369 856243668
2690.2 856243668 857929993 857907257 856776276 856237564 852728577 852883453 854393158 854273682 853479614
2694.6 853479614 854770508 855717392 855759888 857186813 859953995 859140778 854260330 851351318 851840515
2698.9 851840515 852736130 854338684 855275421 856458511 855475845 853909760 855231018 855574036 853761520
2703.3 853761520 853408890 854184265 853922043 853641281 853243561 853294601 853597412 855342560 854236221
2707.6 854236221 854631195 855717621 855185165 854569473 853854599 855259552 852098236 851072845 854414749
2711.9 854414749 852853088 850691605 849989395 849055099 848153305 844599228 845236740 844568939 840414963
2716.3 840414963 839551849 839152298 839299164 840377655 841139069 839196625 836437988 835008163 833457260
2720.6 833457260 831445847 828831482 826089249 822141571 821991119 821063232 818802795 816000443 815890121
2725 815890121 817528305 815608215 813507690 815525055 817517166 819125748 821700668 824707108 828153381
2729.3 828153381 828320541 828661118 830434265 831634064 831630630 830815964 833301086 835082855 833521347
2733.6 833521347 834493332 836337280 837338562 838359604 837989197 838493881 838241272 839175034 839464722
2738 839464722 837597122 837872086 839836121 842454300 843757706 842390823 842862320 842505417 841368866
2742.3 841368866 840624313 837516708 839879456 841146774 840924072 844031601 844165955 843108749 844239349
2746.7 844239349 845859756 845535660 846045456 847273712 846166534 845904694 847122726 845933990 846334152
2751 846334152 846109390 843839035 844153366 845418015 845754700 846568680 846586990 846671524 846408539 845410919
2755.8 845410919 845175705 846205597 847241364 847836304 846301727 845079193 847299347 846352081 845325928
2760.2 845325928 847501755 846508026 848032455 849411697 845431671 845437164 846971817 848030167 846712875
2764.5 846712875 845186996 845933304 845531158 844476013 843025360 844609604 845821533 843458862 842638168
2768.8 842638168 843920441 843811340 845567322 846187515 844761887 843572922 842778244 843367157 846782303
2773.2 846782303 848609619 845340042 841332092 841839523 843070602 844314423 846178207 844602356
2777 844602356 844214859 844387207 845866928 849778519 850024872 846717529 846464005 846976318 842929459
2781.4 842929459 840349808 841118851 841966934 842569199 841458588 839878082 838324280 838191452 839443665
2785.7 839443665 839236526 837854385 838204422 840478592 840483780 836326599 834828949 834376221 832680511
2790.1 832680511 832197800 832498550 831779556 833472824 834618073 833456268 834005814 833499680 831902924
2794.4 831902924 829981995 827883606 825298157 826557617 825385590 820213013 817828903 819542389
2798.3 819542389 821831970 820754623 816770706 816207352 816195297 814457855 813660278 813474121 811812057
2802.6 811812057 807952881 804185867 806179047 807089233 802802734 799032516 799710770 800066681 797315903
2806.9 797315903 795754166 794883423 793651505 790795288 789550552 791151276 789246521 786236267
2810.8 786236267 785252228 783323669 781224670 780435257 780534592 778857651 774476166 772135239 768337708
2815.1 768337708 766669922 766210022 764535141 760563431 756106110 753071289 750165405 745940781
2819 745940781 741481476 738182602 734709244 727617035 720535736 717483978 713870468 705832443 697088852
2823.3 697088852 692305069 685435486 676049118 666387024 654659119 640909805 629011459 617375565
2827.2 617375565 605876503 595711784 581906013 568246460 556229095 542534943 529909668
2830.6 529909668 520288239 509757767 502548752 496400185 491406937 488268166 484509926 484166756
2834.4 484166756 487086639 488720360 489901352 491708031 494822197 496971092 499824944 503054848
2838.3 503054848 506597366 510304031 514164658 518616066 521956635 525499535 530120850 534052162
2842.1 534052162 537799873 544360352 546786079 548825264 552219620 553911934 556569939 558749657
2846 558749657 561175041 561162682 559596443 557981529 555806999 551213570 549481392 546926041 539762840
2850.3 539762840 532633018 525776596 518451920 511435127 505980110 500555420 495763283 492292557
2854.2 492292557 489553909 489079285 487956276 485436325 485756721 489061432 491093597 492393265 495767059
2858.5 495767059 499959183 502905731 507872429 514393196 517402916 519959908 524790611 529552612
2862.4 529552612 531969299 534234238 536862831 537888680 537102623 534278793 533686447 533859673 531506424
2866.7 531506424 528208847 527148895 523873711 519960480 513439598 508055649 505329361 500858002
2870.6 500858002 494844666 488373909 485308495 482908363 478247299 475816917 472229233 465703163
2874.4 465703163 460801163 458458328 458447838 456474037 453174095 452148781 451109161 451168060 451280060
2878.8 451280060 449056244 448355408 448860779 447661972 445629539 443080864 441608734 438452148 433624687
2883.1 433624687 431164055 429669113 426695824 422658463 419427567 415545807 409492760 405156670
2887 405156670 405035477 405592499 402971230 401317787 399412155 396102791 394475250 393805695 392480583
2891.3 392480583 394633675 397704659 396341934 393371582 393621521 393990898 395937843 397533607 396199646
2895.7 396199646 393595085 394477043 396766167 395475845 394001045 391934738 389413185 389309654 387611275
2900 387611275 383753815 380894241 379095497 380411301 380522079 376958351 375365753 375479622 374739037
2904.3 374739037 373145142 370315666 367380600 366645432 365077972 361162949 356807747 354451523
2908.2 354451523 349935570 343156090 337387466 332822495 329521980 325775986 322435913 319936504
2912.1 319936504 316054306 311437092 306471519 303993683 299602776 295903816 295701752 292503529
2915.9 292503529 289167480 286143532 283471775 283629036 286467381 288390465 287868843 288818283 288608456
2920.3 288608456 288641071 289861526 290732651 289913921 291098518 293078308 294212952 297556057 298826103
2924.6 298826103 298496208 301034927 304637394 305185547 304720669 309371719 314928722 317436695 320339661
2928.9 320339661 321324043 325428543 331663399 337687569 343627167 349534492 352136688 355239296
2932.8 355239296 360344048 363575668 369359970 376051636 380677376 383306427 386464806 391270599
2936.6 391270599 396436157 401525383 406268463 411119003 417070770 424441338 430153923 433407898
2940.5 433407898 439108963 449434967 459413147 465536575 471764946 479935036 487944107 495752068
2944.4 495752068 503502922 512185783 516614609 521180725 530385971 538313560 543386383 548946724
2948.2 548946724 556045570 557094955 557242508 562567444 567403793 569864349 567639618 567154732 567964134
2952.6 567964134 567782135 567791786 562868996 561596756 557851334 553435173 547998543 538538361 533510742
2956.9 533510742 528569794 517594032 509180832 503183899 493019562 480882759 471029205 461846085
2960.8 461846085 451682243 442007484 430509758 423351173 417264900 408900223 404466820 401616325
2964.6 401616325 397582092 395366859 399297066 402817345 402982407 405734787 413258171 421167374
2968.5 421167374 431784935 445022507 454301262 463027153 474906731 489812241 503734283 517223206
2972.3 517223206 530527153 543235550 554459839 564509315 575290527 584757118 592096825 596838722
2976.2 596838722 603001251 611205597 617419662 624481964 630432930 632509422 639094391 646627579
2980 646627579 652935944 657864304 664560547 672322006 673908691 674973907 681834412 684599533 685371017
2984.4 685371017 685651627 685428696 684817429 683315353 682210464 682533188 683913040 686303406 687166214
2988.7 687166214 689704742 692596436 698063660 703398895 703952103 705774078 711681213 718574905
2992.6 718574905 721493454 720108261 724328232 730486526 731627884 731327591 734910278 736823044
2996.4 736823044 733296890 730668716 733502274 735131531 736052094 736519775 735401993 731505966 729259491
3000.8 729259491 727882996 727511978 722851791 717755585 713174210 711025085 712470245 708864441
3004.6 708864441 703417358 701985626 700151978 697167664 694978409 693120117 692332916 691169815
3008.5 691169815 690267715 686039047 685637131 688522186 687937622 683443069 682008209 686798935 689814529
3012.8 689814529 690584488 691596985 692256393 693588181 694513626 698616791 706291962 711999512 713359146
3017.2 713359146 717915421 722426529 724841690 729427567 734506226 738841629 742034760 747384796
3021 747384796 752797928 757240372 760293884 766354141 769464569 771079636 773531113 776007233 778035126
3025.4 778035126 780508652 783769302 785521088 786724472 787979431 788936386 790479660 795553894
3029.2 795553894 796873398 793914795 794686737 795038376 792504654 792690582 793739624 796202011 796246033
3033.6 796246033 792932434 792696762 792297287 789656677 791141586 792648773 795181198 795103607 794244003
3037.9 794244003 793262787 790746384 790410309 792708130 792446747 788475571 786283417 783753128 782476654
3042.2 782476654 781552353 779250488 779109039 781109619 777439423 775047684 776267776 777374191 775683594
3046.6 775683594 777461166 778683929 775551834 776124496 779299545 781714172 779542313 778851089 780801468
3050.9 780801468 781091156 781031265 785130692 785476608 782566681 782516174 785000763 784783630 784380417
3055.3 784380417 786889572 789046097 789173203 790178986 790628510 789853745 786968460 784102325 785941238
3059.6 785941238 788493347 791502533 790078888 785726471 784390564 784380188 781642303 776817398 776342545
3063.9 776342545 773989639 769006882 763491669 757697067 757778931 757714310 755078201 749677582 745480957
3068.3 745480957 741818314 734399414 731512375 730984344 727527618 727958755 728886032 726953430 722532272
3072.6 722532272 717605438 719440308 722421494 722774200 725292053 730134125 729152374 728593826 728018036
3077 728018036 732642670 737639236 736416702 729352798 724739914 727074966 729149246 725775452 725653534
3081.3 725653534 725413208 720430908 716130676 714290009 711515884 709938965 711462936 711613617 713883438
3085.6 713883438 717468796 722796021 727198563 731449738 739206619 748954849 753556061 756804047
3089.5 756804047 761498718 765841293 770709686 778147049 784757309 785959778 785515289 791203384
3093.4 791203384 794231415 796436462 799053192 799157639 802095261 805618286 806440048 806551971 805192184
3097.7 805192184 805545502 809798889 809881973 809667511 812734528 814607010 815411377 817164841 818121185
3102 818121185 821325531 823650208 820111084 820205917 821578598 820601120 819880676 819003906 819101944 821040421
3106.9 821040421 824261169 822605057 823447037 826548996 824880524 822815857 826690063 825535812
3110.7 825535812 819712753 821945572 826339645 831401978 831932602 829195633 830421295 828227386
3114.6 828227386 826782761 828034592 830342178 828178787 826414185 826219635 824677048 825305099 826601944
3118.9 826601944 830317459 833099289 831617126 829575882 827055435 826285629 829632339 833689575
3122.8 833689575 833621826 835409241 836375732 834946213 832963181 833567505 835781326 834982147 837698212
3127.1 837698212 833885040 829292984 832195358 836949921 838022308 835806732 835150681 836835937
3131 836835937 835796585 832980804 833682022 833558578 831114883 831739807 832738724 834766006 835536957
3135.3 835536957 834542847 832545395 834850845 837774277 835879364 834075851 835373993 837616425
3139.2 837616425 837467346 834796448 835398865 836271210 836220474 835805435 837689285 839045410 834291229
3143.5 834291229 828598938 830121918 835940323 834863968 831680832 832525711 836603851 838535156
3147.4 838535156 836106644 834885635 834664078 836913071 837023621 836843338 835282364 834659805 837371445
3151.7 837371445 837499237 837160568 835472107 832717972 831685410 832213364 831889420 835320358 837418976
3156.1 837418976 834352188 836548233 839771194 835113220 831120224 835789795 837108307 832024765
3159.9 832024765 830506897 831005554 833178482 833416061 833255310 835712280 836406174 837707520 838178711
3164.2 838178711 835598145 835721970 838491898 838742676 836874771 839027481 839135742 834508667 831862411
3168.6 831862411 831512222 829712372 831447372 833045273 837300568 841131287 838091431 832140427
3172.4 832140427 834074783 836183472 837436752 834484329 831019516 834768677 832757339 832785797 834713211
3176.8 834713211 834658585 834881897 836794128 836587677 835419693 833767853 835131683 833520660 833068924
3181.1 833068924 835378265 833381805 835496902 836531525 833025360 835151749 833251495 831273956
3185 831273956 838297577 840322723 836328812 834440384 839674988 839654922 833599625 831041260 833924332
3189.3 833924332 837805405 837480392 833730850 831647110 831160583 830094147 829514999 831851654 834813690
3193.7 834813690 832750549 836123428 839216080 835017700 832691956 835866165 835510712 835547409 834703293
3198 834703293 831801910 829057236 830455399 833004913 832057495 835192642 837159424 833373795 831723328
3202.3 831723328 833848114 832642746 831089554 834588089 835270767 831610260 835785446 839791489
3206.2 839791489 836082611 834644089 832593918 833015289 836782455 835849762 837297211 838572540 836877213
3210.5 836877213 831766357 829361267 832173462 834955597 836056747 834522552 832233276 828148804
3214.4 828148804 830258026 834005966 835061951 834250565 828442383 826527252 828574600 828977814 829488297
3218.7 829488297 833717499 833377533 832341080 833008270 828338318 828901978 832935028 831571960 831677246
3223.1 831677246 836269608 836252213 832773132 831463318 831145401 832591553 830192184 825642929 823215942
3227.4 823215942 826660004 828796768 825518036 828543015 833524170 831496429 830031204 831169815
3231.3 831169815 835358582 831039505 823562317 826010818 830005264 830675735 827910614 825827179
3235.1 825827179 825137329 827597046 830937500 831334152 826928253 825352402 830042343 831018906 829039154
3239.5 829039154 829672546 830983810 829466324 831927109 835695801 830840912 823182831 823629761 826162338
3243.8 826162338 825258942 825433044 826326065 824952393 821884308 824704819 827135086 826945572 826187286
3248.2 826187286 827548676 828443222 825552673 829430084 829070435 824104156 825370483 825205917 824735870
3252.5 824735870 830066223 832199783 832705536 825714035 821292572 824960022 833264923 832295303 826341324
3256.8 826341324 823367615 821872635 828024292 828816299 825450287 824301453 827715836 831618729
3260.7 831618729 829425049 824622116 827312393 826848679 822516174 823324814 826014786 828536377 826382599
3265 826382599 824696579 828779297 828658981 824349136 823111420 827672577 829214554 826130981 826648026
3269.4 826648026 828892746 831754379 831315460 825577545 820334702 819479904 823619995 823726044 822051620
3273.7 822051620 822668610 820554199 821476746 826847458 832317810 831420975 824326019 823052826 826718445
3278 826718445 826738205 824497299 825892029 826125565 825638962 829557724 829346924 825667038 824235458
3282.4 824235458 821955338 821726303 821923523 824043655 823186264 819616089 820763092 824616928 824108734
3286.7 824108734 825532761 825034485 823797913 821949005 822826767 821288605 819882126 821354675 819358749
3291.1 819358749 814056320 816644058 822018585 826789627 827504883 824703369 820231400 818362045
3294.9 818362045 820742722 821999207 822441559 820930634 824955902 829923019 831108704 824691238
3298.8 824691238 814665375 815087967 817472763 818282166 817184525 818175964 823944397 825966873 825770416
3303.1 825770416 822898941 819615555 819948807 820376511 824314575 825936966 827177048 826380692 824508057
3307.5 824508057 823638000 823063736 824467621 822246323 820248184 818372650 820152817 821665726 824313431
3311.8 824313431 825028458 823557510 821107407 820787506 820858459 814890823 815690155 820975342 821427383
3316.1 821427383 823150940 825747681 825833740 823199005 820567093 821838531 828889008 822854538 815990219
3320.5 815990219 823193588 826021805 823708344 823070984 823399277 824137268 821979980 820994492 819347992
3324.8 819347992 821031342 824157486 823103790 821151047 819634323 821965256 824533157 823156433
3328.7 823156433 822521744 821473312 820491562 817820892 813724976 815654373 819628754 820789108 817558594
3333 817558594 811657944 811543732 811770477 815761948 814145050 814216003 817766418 818068314 817004166
3337.4 817004166 818487244 817997665 814936066 814509354 815380249 817324295 818729858 816797943 817471848
3341.7 817471848 821188660 819413910 816528473 818379745 817803421 815507202 815641022 821167526 820008850
3346 820008850 816376114 814633484 814618301 818270187 821666412 818083115 817787781 821149139 819688568
3350.4 819688568 816018448 814389648 819001770 823076935 818545303 813670731 813039398 815307083
3354.2 815307083 816813812 815544205 815596924 815322876 814920807 814351425 815032196 816228333 813997726
3358.6 813997726 812144241 815900726 819456177 819774704 815653534 814572449 817337646 816334915
3362.4 816334915 814102325 818734436 821101532 820985718 818812943 820548096 820617905 820833588 819591675
3366.8 819591675 819367752 819440918 821940155 822132645 818178635 819154358 819141312 821458740 823123474
3371.1 823123474 822755737 819609451 819871750 823052139 822843933 821185684 818031845 816454468 814376526
3375.5 814376526 813722534 812721786 813973541 820193710 819025726 818470383 818530579 814866409 815410385
3379.8 815410385 818098755 818011246 820131454 821444092 818968353 817922440 818940277 820129013 818233185
3384.1 818233185 818614578 817487869 814991608 815897980 817791977 819746552 820710449 819352646 819576263
3388.5 819576263 820213470 817630310 816571045 816091690 814707565 812501297 812371368 810856171 813545990
3392.8 813545990 816432648 817629013 815750198 813531952 814428558 813473206 813713303 812980347 813006592
3397.2 813006592 816619873 819578552 817068863 816416245 816594238 815165405 818520203 819834518 814646378
3401.5 814646378 814247055 815205460 815568542 819170837 815021744 810699539 813014374 816161118 816424637
3405.8 816424637 818089676 821175690 823878174 821145935 816459732 817388458 818908997 817584686
3409.7 817584686 816210632 817202759 815064926 813566971 813014297 816893082 818260040 816266479 814243164
3414 814243164 815388794 817097397 816076431 820612640 824379272 814581070 810328598 813802109 815712509
3418.4 815712509 814754410 815188141 813054352 812077103 815758057 817479401 816062469 815151138 813255157
3422.7 813255157 811368942 811648026 820292435 825373764 813245697 806681595 812538223 813262558
3426.6 813262558 813565369 812019958 808984070 815111160 821777725 817551346 815373001 819611130
3430.4 819611130 816894379 815875168 816942368 817921753 819161224 814695435 817666245 820822525
3434.3 820822525 822132492 823518906 826025467 822130661 820490189 820809097 819011154 818131027 820211258
3438.6 820211258 819933548 820236588 817128143 811999054 814607849 816875076 815083313 815713882 821110916
3443 821110916 823299637 820298767 819625015 820359421 819711304 819240952 822712631 823733063 821900024
3447.3 821900024 820277252 817433548 812243652 814923706 820714417 822157822 822061920 825813370 823096390
3451.6 823096390 820523453 820848236 824800720 823968124 822495041 824408875 823437881 820046005 819292145
3456 819292145 819781723 821473846 819011002 821472473 820958633 817592773 817134247 815641556 816682281
3460.3 816682281 818290863 818243408 817941666 819094772 824096146 827039108 822720184 820124283 823682632
3464.7 823682632 823149719 825159683 822825851 824658203 825250320 823597565 822643051 820634689 820217438
3469 820217438 819475403 816241379 816457138 819926834 822949677 823552933 822294769 820167847 820991898
3473.3 820991898 823595657 822629700 821922302 826591644 831246033 826217575 822117310 825739212 826081924
3477.7 826081924 823656693 823153839 821852951 818852310 823088074 825777283 826963196 828486557
3481.5 828486557 827564545 822955017 825136948 825566254 820213852 819512482 823073654 826839371 829527054
3485.9 829527054 828216782 821797104 817399445 821346512 821230545 820867844 824286118 824105072 820911713
3490.2 820911713 825552368 829428864 831604919 832363281 832591553 827042618 825984573 828990479 833306198
3494.6 833306198 834645157 827638092 821967239 819549103 823610764 823059158 821640930 825377121
3498.4 825377121 825574265 822776108 822412415 827352676 829962082 829752274 826450195 826629181 830095901
3502.8 830095901 830106583 827894135 827327347 830182190 832607880 830278702 829889832 833905182 832211304
3507.1 832211304 826632843 825148773 828985138 835447388 833782425 828266983 827688370 829652252
3511 829652252 829962616 832071228 832112350 832167053 831254807 827281570 825975800 826206818 828274612 829947891
3515.8 829947891 835623627 835891953 829348373 828919525 830508652 829905319 828963470 831465454 831865692
3520.1 831865692 828941574 833379059 833945312 832015762 834602509 835254974 831500397 830843506 828432846
3524.5 828432846 831237030 834849854 837034912 835723648 832059708 829705048 829156799 833863373
3528.3 833863373 837903061 836138916 830744629 832193451 834386444 833228760 833062897 830043182
3532.2 830043182 829670105 831131287 832560425 829341354 831721115 833201599 831949005 832705765 831679459
3536.5 831679459 825659256 830878677 834366608 834324570 837828140 836993027 828968887 825709610 828101807
3540.9 828101807 834333191 837504501 831622925 825908432 827421951 830253448 830802383 833340836
3544.7 833340836 835269318 836893158 839945602 837179489 835051880 835306702 832492447 834560242
3548.6 834560242 836118774 835636520 839282837 838020630 836731567 835880737 834679337 837541809 841717758
3552.9 841717758 839545288 834616394 830542755 831317749 836134033 836007080 833734665 831407318 830268860
3557.2 830268860 837945938 845365753 844307251 841994476 840113678 838143845 834528046 827339401
3561.1 827339401 831338120 835902557 835703583 837599869 841190033 841051865 842571716 842185287 840275803
3565.4 840275803 843965378 839758759 836787643 842419662 840765228 835172653 836294632 841143341
3569.3 841143341 845233841 846936035 844133835 840844040 839304504 839192886 840023193 840069580 840205154
3573.6 840205154 843445282 848054810 845194702 839237137 834615097 831780853 839088593 844441452
3577.5 844441452 835259857 830115433 832295074 834269714 834004745 836068268 836937866 840060883 840177307
3581.8 840177307 834846573 835101547 834659119 835498123 842956696 842006989 838352051 840107117 837821808
3586.2 837821808 832401886 829868164 834482346 838339157 837095642 841064072 841968155 840013809
3590 840013809 838670197 836809692 835697784 840050354 844645538 845653152 840558624 836996536 841517487
3594.4 841517487 843046951 838745117 838320770 842127304 847030258 843776398 843968811 844882507 844533997
3598.7 844533997 844101028 844066696 842221985 843125992 845010300 845137177 843666306 845161438 845228043
3603.1 845228043 838445969 835910721 838606491 840345078 843218155 846410675 846505890 846126709 844415741
3607.4 844415741 846152954 845109558 842511444 841450882 837183380 836454926 846666107 850106888
3611.3 850106888 848320770 849218903 842398224 837196808 836427765 840977249 844206161 841181717 841344070
3615.6 841344070 843061142 849318848 849267120 850687256 859195099 851186218 842204590 839761963 838123016
3619.9 838123016 837110977 837848969 840626297 843620834 846205597 844539719 840454254 840780869 845282974
3624.3 845282974 852122650 845552292 841221237 843025513 846930389 847608032 844297333 842058792
3628.1 842058792 849783401 845193176 838461380 840181046 843463593 841090240 834370422 837623596
3632 837623596 841265717 839489746 835631104 835404358 837811890 835524139 834674072 837244492 837936401
3636.3 837936401 837436905 839930267 839519806 842845383 844013519 840414658 838110428 837258682 839064865
3640.7 839064865 844049149 843037567 838247681 839926910 843391037 843202744 841589966 841552887 839127655
3645 839127655 841748428 847181473 848818436 849724731 843721542 837779846 837768860 844767914 853016891
3649.3 853016891 849723129 847140503 846465836 840754395 841405106 840553131 838067627 837338104 837500992
3653.7 837500992 838440781 840868454 843563766 843147507 838554153 833576584 835046844 837194366 838440475
3658 838440475 836655045 836628494 839378738 842385559 839391708 840321198 844582214 844331894 844619522
3662.4 844619522 844722137 843327408 843345108 839189987 836652145 838709488 840358276 843215103 842671356
3666.7 842671356 844259567 847003174 846704102 838973083 838211288 845030823 847867203 837053070
3670.6 837053070 825323792 828144684 839346619 841081467 841525726 845499954 853207169 853891449
3674.4 853891449 845347824 852558746 846735382 839976654 845186234 843906937 847192459 842212067
3678.3 842212067 839643326 843148956 842259903 840462570 844033432 846222305 844729385 843060150
3682.1 843060150 841596756 843084030 844884872 846897583 844608383 840941086 842854767 846695328
3686 846695328 853182373 852867966 849662476 847622528 839639282 840332489 842999496 844020767 847246780
3690.3 847246780 844335251 842493439 843818741 842013321 842353134 847642670 850220642 845165024
3694.2 845165024 839751892 837685699 843066330 847359848 843761063 842436447 842823105 846253586
3698.1 846253586 847659454 847258987 845951462 842649231 839683380 842369308 845537491 848168793
3701.9 848168793 849970016 849508972 846292419 844976959 848512115 849686966 846956482 846820908 848182983
3706.3 848182983 850307312 851114349 849770355 849827423 849431610 847065659 847056732 851562042 850091782
3710.6 850091782 854389725 860542068 850380783 841589508 841935959 840163498 841372757 845705872
3714.4 845705872 852323914 854502029 853271942 847054977 841955566 843903046 842163696 842600784
3718.3 842600784 849924011 849339294 845010452 844863434 846668472 848730087 851349182 851097717 851357346
3722.6 851357346 850491257 847417221 849753647 853859329 853990936 852425537 848124695 840858002 840115814
3727 840115814 844546356 851699066 850677795 850431824 849542389 846985016 843942490 849675903 853982010
3731.3 853982010 848937149 853655548 849859848 846454163 852793427 860708237 859195557 847275696
3735.2 847275696 845192566 850177765 847760162 846551208 848428497 851220932 851793213 849479218
3739 849479218 852843094 849905701 846075287 847837067 843792114 839882202 842524109 842806625 849088440
3743.4 849088440 869841309 867391281 818783340 830209045 844212494 847252579 849153442 846391983
3747.2 846391983 853079300 859070663 860728073 854635925 832050247 832550812 851908951 856415710
3751.1 856415710 848072739 836955032 826654358 834279251 844070435 844418716 839425125 843242645
3755 843242645 851081009 855003586 849469910 842653885 844113617 846305237 845540619 847204742 850286102
3759.3 850286102 845978470 842848358 841455612 843746872 845736694 843853989 841551666 845559998
3763.2 845559998 846660233 839361115 840733185 838048706 832361450 829932785 832263107 836415558
3767 836415558 839044037 844239197 850548325 857894592 855857162 846541519 840037994 835814438 838237686
3771.3 838237686 843768158 842308960 841868134 842735901 840902863 841230011 843414154 843879242 842836456
3775.7 842836456 840228577 838644409 841010056 839308395 840661774 840711288 838405838 833194809 835085068
3780 835085068 837859192 838499756 837864609 842980499 843466110 841496124 841307907 843171692 840872955
3784.4 840872955 836165695 835023117 836174164 835700912 834866714 838346863 841843491 841847992 840278397
3788.7 840278397 838936005 836754227 835340576 840191422 842150650 841028671 844016190 846757202
3792.6 846757202 843578720 842488098 848046494 842819138 835908279 838515701 839891968 845096588
3796.4 845096588 850427094 849299011 845418625 843679047 839373093 836671219 837703171 846680374
3800.3 846680374 858562622 859286499 840410156 835343399 842286835 843015213 842110138 845503006
3804.1 845503006 846827316 847009430 850231171 851540756 843754044 833026352 830817108 837116165
3808 837116165 840725403 841884842 839496841 835120316 837262726 844182816 843889160 837726135 833376694
3812.3 833376694 836199570 841788177 842379456 842098236 852376556 859411392 853155518 841411133
3816.2 841411133 836326752 838689270 843287201 843456802 840940247 845909805 849786835 841458282
3820.1 841458282 836577759 849157791 851359787 846357498 844494247 838849335 838949585 841047745
3823.9 841047745 841593170 838261642 839725723 842630081 843233414 836051483 837267303 836250153 836262817
3828.2 836262817 836866226 837929993 842257462 845147934 846644058 846314316 846329041 849878769 844037552
3832.6 844037552 839688721 837455673 840250778 844818726 844657898 838707504 841112137 841584015 841933517
3836.9 841933517 847161942 844342422 838298187 842620163 846406708 847588806 846812210 845689621
3840.8 845689621 844314957 847096252 848551483 844926300 842400360 840225601 835487213 835297470
3844.6 835297470 841960373 842028809 840550995 840687866 841871033 843573532 844810028 846628265 844885330
3849 844885330 842131042 842947922 846465302 849370270 848328018 846735764 842120514 849495697 846933746
3853.3 846933746 845843964 838771286 832124405 838931808 837616806 836658936 841035767 844752197
3857.2 844752197 846058731 845531998 844169998 840030212 838676453 842985611 843504868 844570847 840970612
3861.5 840970612 839746246 839321976 838329620 843804626 843999710 845017929 844666061 837908325 835424881
3865.9 835424881 838839722 840539932 840222168 842647324 842478333 847383499 851227036 847250977 840369339
3870.2 840369339 836117554 836148834 839766388 840101700 841405029 842978516 844626694 841579361 840747681
3874.5 840747681 840395355 841295624 841569214 842519226 842361832 841535034 839169159 839782639 839972153
3878.9 839972153 840995255 840824127 838771591 833563004 829440765 832924347 839338455 840240784 838898544
3883.2 838898544 838955994 838125687 844123840 846402206 841009064 836002426 834683685 836126099 842469940
3887.6 842469940 843847427 842378464 843565292 846049881 846231232 846603851 847495575 842912903 835440445
3891.9 835440445 833389130 838239746 840774460 840091400 837934723 832060547 830193634 835409317
3895.8 835409317 841656342 842807236 844115219 846206665 843905258 838958588 840276260 841210403
3899.6 841210403 841062317 840623550 840574341 839848938 834260635 830316315 834879761 838296814 838112183
3904 838112183 835189209 834912720 840960312 840652466 836119843 835949554 839752197 840517044 839137955
3908.3 839137955 841330261 838269806 835084000 839284515 844933090 838957672 834318314 839046402
3912.2 839046402 840235062 837350922 833791046 835315018 840253525 839446945 836947861 837655334 839833527
3916.5 839833527 839639664 837381439 838247223 838331680 835030365 835935211 837673721 837325363 836219482
3920.8 836219482 834103394 830739059 826974716 828764038 836333313 842598114 843101654 839894104
3924.7 839894104 834886932 834498596 837881317 841531067 837814941 834004745 840766068 839897003 838443832
3929 838443832 837416687 836555634 837089157 840391693 843616562 840357971 835381012 837997208 839337463
3933.4 839337463 835439606 834169006 835691376 842100143 843928909 840234528 838799591 842443466
3937.2 842443466 843938293 834894943 830837097 833627243 839143753 840630341 840718155 838940125 838095627
3941.6 838095627 839897232 836787186 836077347 835093689 836282959 836523285 832113800 834852066 838413849
3945.9 838413849 837034531 839652863 838412476 838406677 834933701 832650223 835584030 837729034 836439972
3950.2 836439972 834514389 831352310 832627945 835863037 836946716 836831589 833694687 835460663
3954.1 835460663 835778809 837139359 837921219 837144852 836584625 836273651 829589081 830598984 839147720
3958.4 839147720 839638977 834973831 832555847 836007462 841552887 840231400 838941650 838231125 835185471
3962.8 835185471 832652283 834254532 834059753 834707413 831358643 830199051 831417542 835282440 834430008
3967.1 834430008 834932632 841966324 843814468 841490326 835587616 837414169 841034546 840687637 839710083
3971.5 839710083 836003571 834175873 837824783 838147125 837532272 839474640 838379517 833803558 835514145
3975.8 835514145 837126007 834234161 835022202 834851913 838594055 841534042 835884247 832029343 837441330
3980.1 837441330 838231201 833838806 832205658 833157425 837584610 841424255 842990646 840163116 843412552
3984.5 843412552 838956375 833040314 836258926 836050568 831567993 837327576 839325867 838318253
3988.3 838318253 835305252 835382309 839672546 839400101 838446198 841192398 844486847 846457291 840362015
3992.7 840362015 835224762 839423904 838429794 833190918 834760132 834291992 833704758 834695663 840693970
3997 840693970 842496796 837264481 833540268 838843384 839714203 837332993 837925949
4000.4 837925949
##END=$$ End of the data block
